{"text_format":"1","workbook":"xlsx","n_sheets":5,"sheets":["Introduction","User's Guide","BSM Calculator","Data","Sheet1"],"not_rendered":{"charts":3,"images":13,"macros":1,"external_links":1,"defined_names":1228,"comments":0,"pivot_tables":0},"unopened":[],"bounds":{"document_bytes":16777216,"sheet_cells":100000,"rows_first":2000,"rows_last":500,"rows_between":2000,"halvings":0,"cell_chars":16384,"cell_head_chars":4096},"cells_cut":0,"cells_raw":0,"read":"whole","date_system":"1900"}

{"sheet":"Introduction","index":0,"n_rows":51,"n_cols":9,"rows_kept":51,"cut":false,"hidden":false,"merged":[[2,3,2,9],[3,3,3,9],[7,1,7,6],[5,1,5,6],[5,8,5,10],[6,1,6,6],[6,8,6,10],[49,1,49,11],[50,1,50,11],[9,1,9,11],[10,1,10,11],[11,1,11,11],[48,1,48,11]]}
[]
[]
[null,null,null,"Buy/Sell Margin Calculator"]
[null,null,null,"Version 9.0"]
[]
[null,"Emmit L. Rawls",null,null,null,null,null,null,"Becky Bowling"]
[null,"Professor Emeritus",null,null,null,null,null,null,"Extension Specialist"]
[null,"Office: (865) 974-7271     Email: elrawls@utk.edu",null,null,null,null,null,"Office: (865) 974-7016     Email: rbowlin2@utk.edu"]
[]
[null,"Tammy L. McKinley"]
[null,"IT Solutions Specialist"]
[null,"Office: (865) 974-6545     Email: mckinley@utk.edu"]
[]
[null,"The buy/sell margin (the difference between a feeder calf or yearling purchase price and a sale price at some later date) is "]
[null,"a critical component in the profitability of beef cattle backgrounding and finishing systems. In fact, the margin can make "]
[null,"or break a producer in a single year."]
[]
[null,"This program allows you to look at historical buy/sell margins for buy-sell periods that you select for steers, heifers,"]
[null,"Holstein steers, and finished cattle (5-Market Area)."]
[]
[null,"These historical buy/sell margins can give you some feel for the price risk exposure on purchased cattle as well as calves"]
[null," from a cow/calf program. The absolute buy/sell margins in dollars per hundredweight are one measure of price risk."]
[]
[null,"The BSM Calculator will calculate the minimum (worst), average, and maximum (best) buy/sell margins for the past 10 years"]
[null,"based on your selections of both buying and selling months, state, sex, weight ranges, and grades."]
[]
[null,"To learn more about the buy/sell margin and the Buy/Sell Margin Calculator click on the User's Guide button below."]
[]
[]
[]
[]
[null,"To begin click on the Calculator button below.  Only those values shown in blue text and the dropdown boxes are available"]
[null,"for you to change.  You can navigate through the cells by using the arrow keys or the tab key.  To change a value, select"]
[null,"the cell, enter the new value and press enter.  When changing your input selections, to ensure that all calculations are made"]
[null,"correctly reset the input selections by clicking the Reset button. To return to this introduction page, click on the Intro button."]
[]
[]
[]
[]
[null,"For technical support, contact Becky Bowling at the contact information above."]
[]
[]
[]
[]
[]
[]
[]
[]
[null,"Programs in agriculture and natural resources, 4-H youth development, family and consumer sciences, and resource development."]
[null,"University of Tennessee Institute of Agriculture, U.S. Department of Agriculture and country governments cooperating."]
[null,"UT Extension provide equal opportunities in programs and employment."]

{"sheet":"User's Guide","index":1,"n_rows":115,"n_cols":3,"rows_kept":115,"cut":false,"hidden":false,"merged":[[9,1,13,10],[1,1,1,10],[109,2,111,10],[112,2,113,10],[34,1,36,10],[30,1,31,10],[3,1,5,10],[7,1,7,10],[15,1,21,10],[23,1,28,10],[38,1,44,10],[50,1,55,10],[70,1,73,10],[58,1,60,10],[61,2,61,9],[62,2,62,9],[63,1,67,10],[46,1,48,10]]}
[]
[null,"The Buy/Sell Margin Calculator User's Guide"]
[]
[null,"The buy/sell margin (the difference between a feeder calf or yearling purchase price and a sale price at some later date) is a critical component in the profitability of beef cattle backgrounding and finishing systems.  In fact, the margin can make or break a producer in a single year."]
[]
[]
[]
[null,"Buy/sell margins are calculated as follows:   cattle sale price - cattle purchase price = buy/sell margin"]
[]
[null,"This program allows you to look at historical buy/sell margins for buy-sell periods that you select for heifers and steers. These historical buy/sell margins can give you some feel for the price risk exposure on purchased cattle as well as calves from a cow/calf program. The absolute buy/sell margins in dollars per hundredweight are one measure of price risk. The buy/sell margin is usually negative due to increase in weight, but it can be steady to positive depending on the time period being considered. The buy/sell margin can also be steady to positive if the grade of the cattle increases during the growing-finishing process."]
[]
[]
[]
[]
[]
[null,"As a beef producer, backgrounder, or feeder you must look at these margins relative to your estimated cost of gain. The negative buy/sell margin that you can tolerate and still break even is primarily a function of the relationship between the purchase price and the cost of gain. There are a few points you will want to keep in mind when looking at the margins calculated in the Buy/Sell Margins (BSM) Calculator and comparing these to your estimated cost of gain. First, remember that if the cost of gain exceeds the purchase price, a positive buy/sell margin will be required to realize a profit. The second is that a cost of gain below the purchase price will permit a negative buy/sell margin. And finally, if the cost of gain is the same as the purchase price, the break-even price will also be equal to the purchase price."]
[]
[]
[]
[]
[]
[]
[]
[null,"Prices used in this program to calculate the historical buy/sell margins are the monthly averages from livestock auctions in Tennessee and Georgia and feedlots in Texas-Oklahoma, Kansas, Nebraska, Colorado, Iowa-Minnesota (5-Market Area). The prices from the 5-Market Area were compiled by Livestock Marketing Information Center from federal and state Market News data. The use of these averages does limit the program, because averages smooth out the actual highs and lows in the daily/weekly prices at these markets. You can however, see the general trend in prices using the monthly averages, and seasonal tendencies can be used to determine the \"best\" months for buying and selling cattle."]
[]
[]
[]
[]
[]
[]
[null,"The BSM Calculator will calculate the minimum (worst), average, and maximum (best) buy/sell margins for the past 10 years based on your selections of buying and selling months, state, sex, weight ranges, and grades."]
[]
[]
[null,"Special Options"]
[null,"There are several special cases considered in the BSM Calculator, the first of which is the buying and selling of Holstein steers for a backgrounding program. The grade used for the Holstein steers is Large Frame No. 2.  This is the only grade available for Holstein steers. This option is available for Tennessee only."]
[]
[]
[]
[null,"The second special case considered in the BSM Calculator is that of buying and/or selling a mix of Medium Frame No. 1 and Medium Frame No. 2 cattle. Some producers may choose to purchase either all Medium Frame No. 2 or a mix of Medium Frame No. 2 and Medium Frame No. 1 cattle, planning on some of them upgrading to No. 1 at a heavier weight. The program allows the user to select the percentage of cattle that are expected to be purchased or sold as Medium Frame No. 1. This percentage is then used to calculate weighted average buy/sell margins for the past ten years for either buying or selling Medium Frame No. 1 and Medium Frame No. 2 cattle at the selected weight range and in the selected months. The minimum, average, and maximum buy/sell margins reported are based on the weighted average buy/sell margins. This option is available for Tennessee only."]
[]
[]
[]
[]
[]
[]
[]
[null,"The next special case considered is that of buying and/or selling 50,000 lbs. loads of Medium Frame No. 1 cattle. The load lot prices are from multiple auction markets and video sales across Tennessee. This option is available for Tennessee 700-800 lbs. steers and heifers and 800-900 lbs. steers only. "]
[]
[]
[]
[null,"The final special case considered in the BSM Calculator is that of selling finished cattle from a feedlot in the 5-Market Area. This option is available by choosing \"5-Market Area Finished\" as the selling state. No grade will be listed and the weight range will be 1100-1300 pounds used for all finished cattle sold from the 5-Market Area. The 5-Market Area feedlot prices are from Texas-Oklahoma, Kansas, Nebraska, Colorado, and Iowa-Minnesota for Choice finished cattle. The same market prices are used for finished heifers and steers. If retaining ownership, the freight charge to move cattle from TN needs to be included in the cost of gain calculation."]
[]
[]
[]
[]
[]
[]
[null,"Value of Gain"]
[null,"In any backgrounding/stocker operation the key to profitability is the value of gain exceeding the cost of gain or, in other words, when the value of the added weight exceeds the cost to put on that weight. The value of gain (VOG) is calculated by dividing the difference in beginning and ending values by the total weight gained or"]
[]
[]
[null,null,"  ((sale price * sale weight) - (purchase price * purchase weight))  "]
[null,null,"total weight gained"]
[null,"The VOG increases when either the selling price increases causing the animal’s ending value to increase or the purchase price decreases causing the animal's beginning value to decrease. The VOG will also increase as the buy/sell margin becomes less negative or more positive due to either an increase in the sale price increasing the ending value of the animal or a decrease in the purchase price decreasing the beginning value of the animal. If purchase and sale prices are equal, the VOG will be equal to the purchase and sale price. "]
[]
[]
[]
[]
[]
[null,"Selling Price as a Percentage of Buying Price"]
[null,"The selling price as a percentage of buying price is another way of using the buy/sell margins which can make you aware of the percentage of the buying price you can expect to receive as a selling price at a later date. You may also use the average percentage to predict your selling price from an actual buying price. The projected price assumes the future percentage would be the same as the past, on average. Again, these percentages are based on the selections you made on the input screen."]
[]
[]
[]
[]
[null,"Available Options"]
[]
[null,"Item","Options"]
[null,"State","TN"]
[null,null,"GA"]
[null,null,"5-Market Area Finished"]
[null,"Sex","Heifer"]
[null,null,"Steer"]
[null,null,"Holstein Steer**"]
[null,"Grade","Medium Frame No.1"]
[null,null,"Medium Frame No. 2"]
[null,null,"Mix of No. 1 and No. 2***"]
[null,null,"Large Frame No. 2**"]
[null,"Weight Range","300-400 lbs"]
[null,null,"400-500 lbs"]
[null,null,"500-600 lbs"]
[null,null,"600-700 lbs"]
[null,null,"700-800 lbs"]
[null,null,"700-800 lbs Loads ***"]
[null,null,"800-900 lbs Loads ***"]
[null,null,"1100-1300 lbs*"]
[null,"Month","JAN"]
[null,null,"FEB"]
[null,null,"MAR"]
[null,null,"APR"]
[null,null,"MAY"]
[null,null,"JUN"]
[null,null,"JUL"]
[null,null,"AUG"]
[null,null,"SEP"]
[null,null,"OCT"]
[null,null,"NOV"]
[null,null,"DEC"]
[]
[null,"*","Southern Plains feedlot prices are from Texas-Oklahoma, Kansas, Nebraska, Colorado, and Iowa-Minnesota for Choice finished cattle. The same market prices are used for finished heifers and steers. In budgeting a finishing system, a freight charge of $3-$4 per cwt should be added to transport cattle to a custom feedlot.  "]
[]
[]
[null,"**","A grade of Large Frame No. 2 is used for Holstein steers for the buying and selling months. This option is available for only Tennessee."]
[]
[null,"***","This option is available for only Tennessee."]

{"sheet":"BSM Calculator","index":2,"n_rows":171,"n_cols":14,"rows_kept":171,"cut":false,"hidden":false,"merged":[[89,10,89,11],[79,10,79,11],[80,10,80,11],[81,10,81,11],[82,10,82,11],[83,10,83,11],[84,10,84,11],[9,5,11,6],[9,10,11,12],[85,10,85,11],[86,10,86,11],[87,10,87,11],[88,10,88,11],[70,10,70,11],[75,9,76,9],[75,10,75,11],[76,10,76,11],[58,10,58,11],[59,10,59,11],[60,10,60,11],[61,10,61,11],[62,10,62,11],[63,10,63,11],[77,10,77,11],[78,10,78,11],[64,10,64,11],[65,10,65,11],[66,10,66,11],[67,10,67,11],[68,10,68,11],[69,10,69,11],[27,7,27,8],[24,7,24,8],[21,9,21,10],[21,11,21,12],[22,11,22,12],[37,9,38,9],[37,10,37,11],[38,10,38,11],[39,10,39,11],[23,11,23,12],[24,11,24,12],[40,10,40,11],[30,11,30,12],[28,11,28,12],[29,11,29,12],[25,11,25,12],[26,11,26,12],[19,11,20,12],[27,11,27,12],[23,9,23,10],[24,9,24,10],[1,2,1,10],[26,9,26,10],[20,2,20,3],[20,5,20,6],[19,1,20,1],[25,9,25,10],[20,7,20,8],[25,7,25,8],[20,9,20,10],[18,4,18,6],[19,7,19,8],[21,7,21,8],[19,9,19,10],[22,7,22,8],[26,7,26,8],[19,4,20,4],[22,9,22,10],[23,7,23,8],[17,1,17,12],[18,1,18,3],[29,7,29,8],[138,10,139,10],[142,11,142,12],[143,11,143,12],[144,11,144,12],[141,11,141,12],[140,11,140,12],[29,9,29,10],[28,7,28,8],[27,9,27,10],[28,9,28,10],[32,7,32,8],[33,7,33,8],[31,7,31,8],[31,9,31,10],[32,9,32,10],[33,9,33,10],[30,7,30,8],[31,11,31,12],[32,11,32,12],[33,11,33,12],[43,10,43,11],[46,10,46,11],[158,4,159,5],[138,2,138,4],[138,6,138,8],[148,11,148,12],[138,11,139,12],[30,9,30,10],[145,11,145,12],[146,11,146,12],[41,10,41,11],[42,10,42,11],[153,11,153,12],[152,11,152,12],[147,11,147,12],[149,11,149,12],[151,11,151,12],[44,10,44,11],[45,10,45,11],[47,10,47,11],[48,10,48,11],[49,10,49,11],[50,10,50,11],[51,10,51,11],[56,9,57,9],[56,10,57,11]]}
[]
[null,null,"Buy/Sell Margins Calculator - Input"]
[]
[]
[null,null,"Sex",null,""]
[]
[null,null,"Beginning State",null,"",null,null,"Ending State",null,""]
[]
[null,null,"Beginning month",null,"",null,null,"Ending month",null,""]
[]
[null,null,"Beginning weight",null,"300-400",null,null,"Ending weight",null,"400-500"]
[]
[null,null,"Beginning grade",null,"",null,null,"Ending grade",null,""]
[]
[null,null,"Percent Medium #1",null,"",null,null,"Percent Medium #1",null,""]
[]
[]
[null,"Historical Buy/Sell Margins - Results"]
[null,"Selling Month",null,null,"Buying Month"]
[null,"Year","M1 Price","M2 Price","Year","M1 Price","M2 Price","Buy/Sell Margin",null,"Value of Gain",null,"Selling Price as % of Buying Price"]
[null,null,"----------- $/cwt -----------",null,null,"----------- $/cwt -----------",null,"$/cwt",null,"$/cwt"]
[null,{"$f":"historicalpricesyr2","v":2016},{"$f":"'BSM Calculator'!G141","v":116.25},{"$f":"'BSM Calculator'!H141","v":0},{"$f":"IF(begmth>endmth, historicalpricesyr1, historicalpricesyr2)","v":{"$error":"#N/A"}},{"$f":"'BSM Calculator'!C141","v":{"$error":"#N/A"}},{"$f":"'BSM Calculator'!D141","v":{"$error":"#N/A"}},{"$f":"'BSM Calculator'!K141","v":{"$error":"#VALUE!"}},null,{"$f":"'BSM Calculator'!N141","v":{"$error":"#VALUE!"}},null,{"$f":"'BSM Calculator'!L141","v":{"$error":"#VALUE!"}}]
[null,{"$f":"historicalpricesyr3","v":2017},{"$f":"'BSM Calculator'!G142","v":143.08000000000001},{"$f":"'BSM Calculator'!H142","v":0},{"$f":"IF(begmth>endmth, historicalpricesyr2, historicalpricesyr3)","v":{"$error":"#N/A"}},{"$f":"'BSM Calculator'!C142","v":{"$error":"#N/A"}},{"$f":"'BSM Calculator'!D142","v":{"$error":"#N/A"}},{"$f":"'BSM Calculator'!K142","v":{"$error":"#VALUE!"}},null,{"$f":"'BSM Calculator'!N142","v":{"$error":"#VALUE!"}},null,{"$f":"'BSM Calculator'!L142","v":{"$error":"#VALUE!"}}]
[null,{"$f":"historicalpricesyr4","v":2018},{"$f":"'BSM Calculator'!G143","v":152.55000000000001},{"$f":"'BSM Calculator'!H143","v":0},{"$f":"IF(begmth>endmth, historicalpricesyr3, historicalpricesyr4)","v":{"$error":"#N/A"}},{"$f":"'BSM Calculator'!C143","v":{"$error":"#N/A"}},{"$f":"'BSM Calculator'!D143","v":{"$error":"#N/A"}},{"$f":"'BSM Calculator'!K143","v":{"$error":"#VALUE!"}},null,{"$f":"'BSM Calculator'!N143","v":{"$error":"#VALUE!"}},null,{"$f":"'BSM Calculator'!L143","v":{"$error":"#VALUE!"}}]
[null,{"$f":"historicalpricesyr5","v":2019},{"$f":"'BSM Calculator'!G144","v":135.66999999999999},{"$f":"'BSM Calculator'!H144","v":0},{"$f":"IF(begmth>endmth, historicalpricesyr4, historicalpricesyr5)","v":{"$error":"#N/A"}},{"$f":"'BSM Calculator'!C144","v":{"$error":"#N/A"}},{"$f":"'BSM Calculator'!D144","v":{"$error":"#N/A"}},{"$f":"'BSM Calculator'!K144","v":{"$error":"#VALUE!"}},null,{"$f":"'BSM Calculator'!N144","v":{"$error":"#VALUE!"}},null,{"$f":"'BSM Calculator'!L144","v":{"$error":"#VALUE!"}}]
[null,{"$f":"historicalpricesyr6","v":2020},{"$f":"'BSM Calculator'!G145","v":137.9},{"$f":"'BSM Calculator'!H145","v":0},{"$f":"IF(begmth>endmth, historicalpricesyr5, historicalpricesyr6)","v":{"$error":"#N/A"}},{"$f":"'BSM Calculator'!C145","v":{"$error":"#N/A"}},{"$f":"'BSM Calculator'!D145","v":{"$error":"#N/A"}},{"$f":"'BSM Calculator'!K145","v":{"$error":"#VALUE!"}},null,{"$f":"'BSM Calculator'!N145","v":{"$error":"#VALUE!"}},null,{"$f":"'BSM Calculator'!L145","v":{"$error":"#VALUE!"}}]
[null,{"$f":"historicalpricesyr7","v":2021},{"$f":"'BSM Calculator'!G146","v":159.69},{"$f":"'BSM Calculator'!H146","v":0},{"$f":"IF(begmth>endmth, historicalpricesyr6, historicalpricesyr7)","v":{"$error":"#N/A"}},{"$f":"'BSM Calculator'!C146","v":{"$error":"#N/A"}},{"$f":"'BSM Calculator'!D146","v":{"$error":"#N/A"}},{"$f":"'BSM Calculator'!K146","v":{"$error":"#VALUE!"}},null,{"$f":"'BSM Calculator'!N146","v":{"$error":"#VALUE!"}},null,{"$f":"'BSM Calculator'!L146","v":{"$error":"#VALUE!"}}]
[null,{"$f":"historicalpricesyr8","v":2022},{"$f":"'BSM Calculator'!G147","v":182.92},{"$f":"'BSM Calculator'!H147","v":0},{"$f":"IF(begmth>endmth, historicalpricesyr7, historicalpricesyr8)","v":{"$error":"#N/A"}},{"$f":"'BSM Calculator'!C147","v":{"$error":"#N/A"}},{"$f":"'BSM Calculator'!D147","v":{"$error":"#N/A"}},{"$f":"'BSM Calculator'!K147","v":{"$error":"#VALUE!"}},null,{"$f":"'BSM Calculator'!N147","v":{"$error":"#VALUE!"}},null,{"$f":"'BSM Calculator'!L147","v":{"$error":"#VALUE!"}}]
[null,{"$f":"historicalpricesyr9","v":2023},{"$f":"'BSM Calculator'!G148","v":253.43},{"$f":"'BSM Calculator'!H148","v":0},{"$f":"IF(begmth>endmth, historicalpricesyr8, historicalpricesyr9)","v":{"$error":"#N/A"}},{"$f":"'BSM Calculator'!C148","v":{"$error":"#N/A"}},{"$f":"'BSM Calculator'!D148","v":{"$error":"#N/A"}},{"$f":"'BSM Calculator'!K148","v":{"$error":"#VALUE!"}},null,{"$f":"'BSM Calculator'!N148","v":{"$error":"#VALUE!"}},null,{"$f":"'BSM Calculator'!L148","v":{"$error":"#VALUE!"}}]
[null,{"$f":"historicalpricesyr10","v":2024},{"$f":"'BSM Calculator'!G149","v":221.42},{"$f":"'BSM Calculator'!H149","v":0},{"$f":"IF(begmth>endmth, historicalpricesyr9, historicalpricesyr10)","v":{"$error":"#N/A"}},{"$f":"'BSM Calculator'!C149","v":{"$error":"#N/A"}},{"$f":"'BSM Calculator'!D149","v":{"$error":"#N/A"}},{"$f":"'BSM Calculator'!K149","v":{"$error":"#VALUE!"}},null,{"$f":"'BSM Calculator'!N149","v":{"$error":"#VALUE!"}},null,{"$f":"'BSM Calculator'!L149","v":{"$error":"#VALUE!"}}]
[null,{"$f":"historicalpricesyr11","v":2025},{"$f":"'BSM Calculator'!G150","v":341.18},{"$f":"'BSM Calculator'!H150","v":0},{"$f":"IF(begmth>endmth, historicalpricesyr10, historicalpricesyr11)","v":{"$error":"#N/A"}},{"$f":"'BSM Calculator'!C150","v":{"$error":"#N/A"}},{"$f":"'BSM Calculator'!D150","v":{"$error":"#N/A"}},{"$f":"'BSM Calculator'!K150","v":{"$error":"#VALUE!"}},null,{"$f":"'BSM Calculator'!N150","v":{"$error":"#VALUE!"}},null,{"$f":"'BSM Calculator'!L150","v":{"$error":"#VALUE!"}}]
[null,null,null,null,null,null,"Minimum",{"$f":"MIN(H22:I31)","v":{"$error":"#VALUE!"}},null,{"$f":"MIN(J22:K31)","v":{"$error":"#VALUE!"}},null,{"$f":"MIN(L22:M31)","v":{"$error":"#VALUE!"}}]
[null,null,null,null,null,null,"Average",{"$f":"AVERAGE(H22:I31)","v":{"$error":"#VALUE!"}},null,{"$f":"AVERAGE(J22:K31)","v":{"$error":"#VALUE!"}},null,{"$f":"AVERAGE(L22:M31)","v":{"$error":"#VALUE!"}}]
[null,null,null,null,null,null,"Maximum",{"$f":"MAX(H22:I31)","v":{"$error":"#VALUE!"}},null,{"$f":"MAX(J22:K31)","v":{"$error":"#VALUE!"}},null,{"$f":"MAX(L22:M31)","v":{"$error":"#VALUE!"}}]
[]
[]
[]
[null,null,null,null,null,null,null,null,null,"Year","Buy/Sell Margin"]
[null,null,null,null,null,null,null,null,null,null,"$/cwt"]
[null,null,null,null,null,null,null,null,null,{"$f":"historicalpricesyr2","v":2016},{"$f":"'BSM Calculator'!K141","v":{"$error":"#VALUE!"}}]
[null,null,null,null,null,null,null,null,null,{"$f":"historicalpricesyr3","v":2017},{"$f":"'BSM Calculator'!K142","v":{"$error":"#VALUE!"}}]
[null,null,null,null,null,null,null,null,null,{"$f":"historicalpricesyr4","v":2018},{"$f":"'BSM Calculator'!K143","v":{"$error":"#VALUE!"}}]
[null,null,null,null,null,null,null,null,null,{"$f":"historicalpricesyr5","v":2019},{"$f":"'BSM Calculator'!K144","v":{"$error":"#VALUE!"}}]
[null,null,null,null,null,null,null,null,null,{"$f":"historicalpricesyr6","v":2020},{"$f":"'BSM Calculator'!K145","v":{"$error":"#VALUE!"}}]
[null,null,null,null,null,null,null,null,null,{"$f":"historicalpricesyr7","v":2021},{"$f":"'BSM Calculator'!K146","v":{"$error":"#VALUE!"}}]
[null,null,null,null,null,null,null,null,null,{"$f":"historicalpricesyr8","v":2022},{"$f":"'BSM Calculator'!K147","v":{"$error":"#VALUE!"}}]
[null,null,null,null,null,null,null,null,null,{"$f":"historicalpricesyr9","v":2023},{"$f":"'BSM Calculator'!K148","v":{"$error":"#VALUE!"}}]
[null,null,null,null,null,null,null,null,null,{"$f":"historicalpricesyr10","v":2024},{"$f":"'BSM Calculator'!K149","v":{"$error":"#VALUE!"}}]
[null,null,null,null,null,null,null,null,null,{"$f":"historicalpricesyr11","v":2025},{"$f":"'BSM Calculator'!K150","v":{"$error":"#VALUE!"}}]
[null,null,null,null,null,null,null,null,null,"Minimum",{"$f":"MIN(K40:L49)","v":{"$error":"#VALUE!"}}]
[null,null,null,null,null,null,null,null,null,"Average",{"$f":"AVERAGE(K40:L49)","v":{"$error":"#VALUE!"}}]
[null,null,null,null,null,null,null,null,null,"Maximum",{"$f":"MAX(K40:L49)","v":{"$error":"#VALUE!"}}]
[]
[]
[]
[]
[null,null,null,null,null,null,null,null,null,"Year","Selling Price as % of Buying Price"]
[]
[null,null,null,null,null,null,null,null,null,{"$f":"historicalpricesyr2","v":2016},{"$f":"'BSM Calculator'!L141","v":{"$error":"#VALUE!"}}]
[null,null,null,null,null,null,null,null,null,{"$f":"historicalpricesyr3","v":2017},{"$f":"'BSM Calculator'!L142","v":{"$error":"#VALUE!"}}]
[null,null,null,null,null,null,null,null,null,{"$f":"historicalpricesyr4","v":2018},{"$f":"'BSM Calculator'!L143","v":{"$error":"#VALUE!"}}]
[null,null,null,null,null,null,null,null,null,{"$f":"historicalpricesyr5","v":2019},{"$f":"'BSM Calculator'!L144","v":{"$error":"#VALUE!"}}]
[null,null,null,null,null,null,null,null,null,{"$f":"historicalpricesyr6","v":2020},{"$f":"'BSM Calculator'!L145","v":{"$error":"#VALUE!"}}]
[null,null,null,null,null,null,null,null,null,{"$f":"historicalpricesyr7","v":2021},{"$f":"'BSM Calculator'!L146","v":{"$error":"#VALUE!"}}]
[null,null,null,null,null,null,null,null,null,{"$f":"historicalpricesyr8","v":2022},{"$f":"'BSM Calculator'!L147","v":{"$error":"#VALUE!"}}]
[null,null,null,null,null,null,null,null,null,{"$f":"historicalpricesyr9","v":2023},{"$f":"'BSM Calculator'!L148","v":{"$error":"#VALUE!"}}]
[null,null,null,null,null,null,null,null,null,{"$f":"historicalpricesyr10","v":2024},{"$f":"'BSM Calculator'!L149","v":{"$error":"#VALUE!"}}]
[null,null,null,null,null,null,null,null,null,{"$f":"historicalpricesyr11","v":2025},{"$f":"'BSM Calculator'!L150","v":{"$error":"#VALUE!"}}]
[null,null,null,null,null,null,null,null,null,"Minimum",{"$f":"MIN(K59:L68)","v":{"$error":"#VALUE!"}}]
[null,null,null,null,null,null,null,null,null,"Average",{"$f":"AVERAGE(K59:L68)","v":{"$error":"#VALUE!"}}]
[null,null,null,null,null,null,null,null,null,"Maximum",{"$f":"MAX(K59:L68)","v":{"$error":"#VALUE!"}}]
[]
[]
[]
[]
[null,null,null,null,null,null,null,null,null,"Year","Value of Gain"]
[null,null,null,null,null,null,null,null,null,null,"$/cwt"]
[null,null,null,null,null,null,null,null,null,{"$f":"historicalpricesyr2","v":2016},{"$f":"'BSM Calculator'!N141","v":{"$error":"#VALUE!"}}]
[null,null,null,null,null,null,null,null,null,{"$f":"historicalpricesyr3","v":2017},{"$f":"'BSM Calculator'!N142","v":{"$error":"#VALUE!"}}]
[null,null,null,null,null,null,null,null,null,{"$f":"historicalpricesyr4","v":2018},{"$f":"'BSM Calculator'!N143","v":{"$error":"#VALUE!"}}]
[null,null,null,null,null,null,null,null,null,{"$f":"historicalpricesyr5","v":2019},{"$f":"'BSM Calculator'!N144","v":{"$error":"#VALUE!"}}]
[null,null,null,null,null,null,null,null,null,{"$f":"historicalpricesyr6","v":2020},{"$f":"'BSM Calculator'!N145","v":{"$error":"#VALUE!"}}]
[null,null,null,null,null,null,null,null,null,{"$f":"historicalpricesyr7","v":2021},{"$f":"'BSM Calculator'!N146","v":{"$error":"#VALUE!"}}]
[null,null,null,null,null,null,null,null,null,{"$f":"historicalpricesyr8","v":2022},{"$f":"'BSM Calculator'!N147","v":{"$error":"#VALUE!"}}]
[null,null,null,null,null,null,null,null,null,{"$f":"historicalpricesyr9","v":2023},{"$f":"'BSM Calculator'!N148","v":{"$error":"#VALUE!"}}]
[null,null,null,null,null,null,null,null,null,{"$f":"historicalpricesyr10","v":2024},{"$f":"'BSM Calculator'!N149","v":{"$error":"#VALUE!"}}]
[null,null,null,null,null,null,null,null,null,{"$f":"historicalpricesyr11","v":2025},{"$f":"'BSM Calculator'!N150","v":{"$error":"#VALUE!"}}]
[null,null,null,null,null,null,null,null,null,"Minimum",{"$f":"MIN(K78:L87)","v":{"$error":"#VALUE!"}}]
[null,null,null,null,null,null,null,null,null,"Average",{"$f":"AVERAGE(K78:L87)","v":{"$error":"#VALUE!"}}]
[null,null,null,null,null,null,null,null,null,"Maximum",{"$f":"MAX(K78:L87)","v":{"$error":"#VALUE!"}}]
[]
[]
[]
[]
[]
[]
[]
[]
[]
[]
[]
[]
[]
[]
[]
[]
[]
[]
[]
[]
[]
[]
[]
[]
[]
[]
[]
[]
[]
[]
[]
[]
[]
[]
[]
[]
[]
[]
[null,null,null,null,null,null,{"$f":"CONCATENATE(\"HLSTRS\",(IF(AND(stockerendwt=\"300-400\"),\"34\",IF(AND(stockerendwt=\"400-500\"),\"45\",IF(AND(stockerendwt=\"500-600\"),\"56\",IF(AND(stockerendwt=\"600-700\"),\"67\",IF(OR(stockerendwt=\"700-800\",stockerendwt=\"700-800 Loads\"),\"78\",\"89\")))))),endmthalpha)","v":"HLSTRS45"}]
[]
[]
[]
[null,null,{"$f":"stocker_begmth","v":""},null,null,null,{"$f":"stocker_endmth","v":""}]
[null,null,{"$f":"LOOKUP(begmthalpha,{\"Apr\",\"Aug\",\"Dec\",\"Feb\",\"Jan\",\"Jul\",\"Jun\",\"Mar\",\"May\",\"Nov\",\"Oct\",\"Sep\"},{4,8,12,2,1,7,6,3,5,11,10,9})","v":{"$error":"#N/A"}},null,null,null,{"$f":"LOOKUP(endmthalpha,{\"Apr\",\"Aug\",\"Dec\",\"Feb\",\"Jan\",\"Jul\",\"Jun\",\"Mar\",\"May\",\"Nov\",\"Oct\",\"Sep\"},{4,8,12,2,1,7,6,3,5,11,10,9})","v":{"$error":"#N/A"}}]
[null,null,{"$f":"100-begpercM1","v":{"$error":"#VALUE!"}},null,null,null,{"$f":"100-endpercM1","v":{"$error":"#VALUE!"}},null,null,null,null,null,null,{"$f":"(IF(AND(stockerbegwt=\"300-400\"),350,IF(AND(stockerbegwt=\"400-500\"),450,IF(AND(stockerbegwt=\"500-600\"),550,IF(AND(stockerbegwt=\"600-700\"),650,IF(AND(stockerbegwt=\"700-800\"),750))))))","v":350}]
[null,null,{"$f":"CONCATENATE(IF(begstate=\"Georgia\",\"GAM1\",\"\"),(IF(stockersex=\"Heifers\",\"HFRS\",IF(stockersex=\"Steers\",\"STRS\",\"HLSTRS\"))),(IF(AND(stockerbegwt=\"300-400\"),\"34\",IF(AND(stockerbegwt=\"400-500\"),\"45\",IF(AND(stockerbegwt=\"500-600\"),\"56\",IF(AND(stockerbegwt=\"600-700\"),\"67\",IF(OR(stockerbegwt=\"700-800\",stockerbegwt=\"700-800 Loads\"),\"78\",IF(AND(stockerbegwt=\"800-900 Loads\"),\"89\"))))))),begmthalpha)","v":"HLSTRS34"},null,null,null,{"$f":"IF(endstate=\"5-Market Area Finished\",(CONCATENATE(\"FINISHED\",endmthalpha)),CONCATENATE(IF(endstate=\"Georgia\",\"GAM1\",\"\"),(IF(stockersex=\"Heifers\",\"HFRS\",IF(stockersex=\"Steers\",\"STRS\",\"HLSTRS\"))),(IF(AND(stockerendwt=\"300-400\"),\"34\",IF(AND(stockerendwt=\"400-500\"),\"45\",IF(AND(stockerendwt=\"500-600\"),\"56\",IF(AND(stockerendwt=\"600-700\"),\"67\",IF(OR(stockerendwt=\"700-800\",stockerendwt=\"700-800 Loads\"),\"78\",\"89\"))))))))","v":"HLSTRS45"},null,null,null,null,null,null,{"$f":"IF(endstate=\"5-Market Area Finished\",1200,(IF(AND(stockerendwt=\"300-400\"),350,IF(AND(stockerendwt=\"400-500\"),450,IF(AND(stockerendwt=\"500-600\"),550,IF(AND(stockerendwt=\"600-700\"),650,IF(OR(stockerendwt=\"700-800\",stockerendwt=\"700-800 Loads\"),750,850)))))))","v":450}]
[null,null,{"$f":"IF(stockersex=\"Holstein Steers\",$C$136,IF(begstate=\"Georgia\",$C$136,CONCATENATE(\"M1\",$C$136,IF(OR(stockerbegwt=\"700-800 Loads\",stockerbegwt=\"800-900 Loads\"),\"LOAD\",\"\"))))","v":"M1HLSTRS34"},null,{"$f":"IF(stockersex=\"Holstein Steers\",$C$136,IF(begstate=\"Georgia\",$C$136,CONCATENATE(\"M2\",$C$136)))","v":"M2HLSTRS34"},null,{"$f":"IF(stockersex=\"Holstein Steers\",$G$129,IF(endstate=\"Georgia\",$G$136,IF(endstate=\"5-Market Area Finished\",$G$136,CONCATENATE(\"M1\",$G$136,endmthalpha,IF(OR(stockerendwt=\"700-800 Loads\",stockerendwt=\"800-900 Loads\"),\"LOAD\",\"\")))))","v":"M1HLSTRS45"},null,{"$f":"IF(stockersex=\"Holstein Steers\",$G$136,IF(endstate=\"Georgia\",$G$136,IF(endstate=\"5-Market Area Finished\",$G$136,CONCATENATE(\"M2\",$G$136))))","v":"M2HLSTRS45"}]
[]
[null,null,"Beginning Price",null,null,null,"Ending Price",null,null,null,"BSM","Selling $ as % of Buying $"]
[null,null,"M1","M2","Wtd Avg",null,"M1","M2","Wtd Avg",null,null,null,null,"Value of Gain"]
[null,null,{"$f":"IF(stockerbegwt<300,0,IF(stockerbeggrade=\"Medium #2\",0,IF(endmth>begmth,VLOOKUP($C$137,historicalprices,3),VLOOKUP($C$137,historicalprices,2))))","v":{"$error":"#N/A"}},{"$f":"IF(stockerbegwt<300,0,IF(stockerbeggrade=\"Medium #1\",0,IF(stockersex=\"Holstein Steers\",0,IF(endmth>begmth,VLOOKUP($E$137,historicalprices,3),VLOOKUP($E$137,historicalprices,2)))))","v":{"$error":"#N/A"}},{"$f":"(begpercM1/100*C141)+((begM2perc/100)*D141)","v":{"$error":"#VALUE!"}},null,{"$f":"IF(stockerendgrade=\"Medium #2\",0,(VLOOKUP($G$137,historicalprices,3)))","v":116.25},{"$f":"IF(stockerendwt>=800,0,IF(stockerendgrade=\"Medium #1\",0,IF(stockersex=\"Holstein Steers\",0,(VLOOKUP($I$137,historicalprices,3)))))","v":0},{"$f":"(endpercM1/100*G141)+((endM2perc/100)*H141)","v":{"$error":"#VALUE!"}},null,{"$f":"I141-E141","v":{"$error":"#VALUE!"}},{"$f":"I141/E141","v":{"$error":"#VALUE!"}},null,{"$f":"((($N$136/100)*I141)-(($N$135/100)*E141))/(($N$136-$N$135)/100)","v":{"$error":"#VALUE!"}}]
[null,null,{"$f":"IF(stockerbegwt<300,0,IF(stockerbeggrade=\"Medium #2\",0,IF(endmth>begmth,VLOOKUP($C$137,historicalprices,4),VLOOKUP($C$137,historicalprices,3))))","v":{"$error":"#N/A"}},{"$f":"IF(stockerbegwt<300,0,IF(stockerbeggrade=\"Medium #1\",0,IF(stockersex=\"Holstein Steers\",0,IF(endmth>begmth,VLOOKUP($E$137,historicalprices,4),VLOOKUP($E$137,historicalprices,3)))))","v":{"$error":"#N/A"}},{"$error":"#VALUE!"},null,{"$f":"IF(stockerendgrade=\"Medium #2\",0,(VLOOKUP($G$137,historicalprices,4)))","v":143.08000000000001},{"$f":"IF(stockerendwt>=800,0,IF(stockerendgrade=\"Medium #1\",0,IF(stockersex=\"Holstein Steers\",0,(VLOOKUP($I$137,historicalprices,4)))))","v":0},{"$error":"#VALUE!"},null,{"$f":"I142-E142","v":{"$error":"#VALUE!"}},{"$f":"I142/E142","v":{"$error":"#VALUE!"}},null,{"$f":"((($N$136/100)*I142)-(($N$135/100)*E142))/(($N$136-$N$135)/100)","v":{"$error":"#VALUE!"}}]
[null,null,{"$f":"IF(stockerbegwt<300,0,IF(stockerbeggrade=\"Medium #2\",0,IF(endmth>begmth,VLOOKUP($C$137,historicalprices,5),VLOOKUP($C$137,historicalprices,4))))","v":{"$error":"#N/A"}},{"$f":"IF(stockerbegwt<300,0,IF(stockerbeggrade=\"Medium #1\",0,IF(stockersex=\"Holstein Steers\",0,IF(endmth>begmth,VLOOKUP($E$137,historicalprices,5),VLOOKUP($E$137,historicalprices,4)))))","v":{"$error":"#N/A"}},{"$error":"#VALUE!"},null,{"$f":"IF(stockerendgrade=\"Medium #2\",0,(VLOOKUP($G$137,historicalprices,5)))","v":152.55000000000001},{"$f":"IF(stockerendwt>=800,0,IF(stockerendgrade=\"Medium #1\",0,IF(stockersex=\"Holstein Steers\",0,(VLOOKUP($I$137,historicalprices,5)))))","v":0},{"$error":"#VALUE!"},null,{"$error":"#VALUE!"},{"$error":"#VALUE!"},null,{"$f":"((($N$136/100)*I143)-(($N$135/100)*E143))/(($N$136-$N$135)/100)","v":{"$error":"#VALUE!"}}]
[null,null,{"$f":"IF(stockerbegwt<300,0,IF(stockerbeggrade=\"Medium #2\",0,IF(endmth>begmth,VLOOKUP($C$137,historicalprices,6),VLOOKUP($C$137,historicalprices,5))))","v":{"$error":"#N/A"}},{"$f":"IF(stockerbegwt<300,0,IF(stockerbeggrade=\"Medium #1\",0,IF(stockersex=\"Holstein Steers\",0,IF(endmth>begmth,VLOOKUP($E$137,historicalprices,6),VLOOKUP($E$137,historicalprices,5)))))","v":{"$error":"#N/A"}},{"$error":"#VALUE!"},null,{"$f":"IF(stockerendgrade=\"Medium #2\",0,(VLOOKUP($G$137,historicalprices,6)))","v":135.66999999999999},{"$f":"IF(stockerendwt>=800,0,IF(stockerendgrade=\"Medium #1\",0,IF(stockersex=\"Holstein Steers\",0,(VLOOKUP($I$137,historicalprices,6)))))","v":0},{"$error":"#VALUE!"},null,{"$error":"#VALUE!"},{"$error":"#VALUE!"},null,{"$error":"#VALUE!"}]
[null,null,{"$f":"IF(stockerbegwt<300,0,IF(stockerbeggrade=\"Medium #2\",0,IF(endmth>begmth,VLOOKUP($C$137,historicalprices,7),VLOOKUP($C$137,historicalprices,6))))","v":{"$error":"#N/A"}},{"$f":"IF(stockerbegwt<300,0,IF(stockerbeggrade=\"Medium #1\",0,IF(stockersex=\"Holstein Steers\",0,IF(endmth>begmth,VLOOKUP($E$137,historicalprices,7),VLOOKUP($E$137,historicalprices,6)))))","v":{"$error":"#N/A"}},{"$error":"#VALUE!"},null,{"$f":"IF(stockerendgrade=\"Medium #2\",0,(VLOOKUP($G$137,historicalprices,7)))","v":137.9},{"$f":"IF(stockerendwt>=800,0,IF(stockerendgrade=\"Medium #1\",0,IF(stockersex=\"Holstein Steers\",0,(VLOOKUP($I$137,historicalprices,7)))))","v":0},{"$error":"#VALUE!"},null,{"$error":"#VALUE!"},{"$error":"#VALUE!"},null,{"$error":"#VALUE!"}]
[null,null,{"$f":"IF(stockerbegwt<300,0,IF(stockerbeggrade=\"Medium #2\",0,IF(endmth>begmth,VLOOKUP($C$137,historicalprices,8),VLOOKUP($C$137,historicalprices,7))))","v":{"$error":"#N/A"}},{"$f":"IF(stockerbegwt<300,0,IF(stockerbeggrade=\"Medium #1\",0,IF(stockersex=\"Holstein Steers\",0,IF(endmth>begmth,VLOOKUP($E$137,historicalprices,8),VLOOKUP($E$137,historicalprices,7)))))","v":{"$error":"#N/A"}},{"$error":"#VALUE!"},null,{"$f":"IF(stockerendgrade=\"Medium #2\",0,(VLOOKUP($G$137,historicalprices,8)))","v":159.69},{"$f":"IF(stockerendwt>=800,0,IF(stockerendgrade=\"Medium #1\",0,IF(stockersex=\"Holstein Steers\",0,(VLOOKUP($I$137,historicalprices,8)))))","v":0},{"$error":"#VALUE!"},null,{"$error":"#VALUE!"},{"$error":"#VALUE!"},null,{"$error":"#VALUE!"}]
[null,null,{"$f":"IF(stockerbegwt<300,0,IF(stockerbeggrade=\"Medium #2\",0,IF(endmth>begmth,VLOOKUP($C$137,historicalprices,9),VLOOKUP($C$137,historicalprices,8))))","v":{"$error":"#N/A"}},{"$f":"IF(stockerbegwt<300,0,IF(stockerbeggrade=\"Medium #1\",0,IF(stockersex=\"Holstein Steers\",0,IF(endmth>begmth,VLOOKUP($E$137,historicalprices,9),VLOOKUP($E$137,historicalprices,8)))))","v":{"$error":"#N/A"}},{"$error":"#VALUE!"},null,{"$f":"IF(stockerendgrade=\"Medium #2\",0,(VLOOKUP($G$137,historicalprices,9)))","v":182.92},{"$f":"IF(stockerendwt>=800,0,IF(stockerendgrade=\"Medium #1\",0,IF(stockersex=\"Holstein Steers\",0,(VLOOKUP($I$137,historicalprices,9)))))","v":0},{"$error":"#VALUE!"},null,{"$error":"#VALUE!"},{"$error":"#VALUE!"},null,{"$error":"#VALUE!"}]
[null,null,{"$f":"IF(stockerbegwt<300,0,IF(stockerbeggrade=\"Medium #2\",0,IF(endmth>begmth,VLOOKUP($C$137,historicalprices,10),VLOOKUP($C$137,historicalprices,9))))","v":{"$error":"#N/A"}},{"$f":"IF(stockerbegwt<300,0,IF(stockerbeggrade=\"Medium #1\",0,IF(stockersex=\"Holstein Steers\",0,IF(endmth>begmth,VLOOKUP($E$137,historicalprices,10),VLOOKUP($E$137,historicalprices,9)))))","v":{"$error":"#N/A"}},{"$error":"#VALUE!"},null,{"$f":"IF(stockerendgrade=\"Medium #2\",0,(VLOOKUP($G$137,historicalprices,10)))","v":253.43},{"$f":"IF(stockerendwt>=800,0,IF(stockerendgrade=\"Medium #1\",0,IF(stockersex=\"Holstein Steers\",0,(VLOOKUP($I$137,historicalprices,10)))))","v":0},{"$error":"#VALUE!"},null,{"$error":"#VALUE!"},{"$error":"#VALUE!"},null,{"$error":"#VALUE!"}]
[null,null,{"$f":"IF(stockerbegwt<300,0,IF(stockerbeggrade=\"Medium #2\",0,IF(endmth>begmth,VLOOKUP($C$137,historicalprices,11),VLOOKUP($C$137,historicalprices,10))))","v":{"$error":"#N/A"}},{"$f":"IF(stockerbegwt<300,0,IF(stockerbeggrade=\"Medium #1\",0,IF(stockersex=\"Holstein Steers\",0,IF(endmth>begmth,VLOOKUP($E$137,historicalprices,11),VLOOKUP($E$137,historicalprices,10)))))","v":{"$error":"#N/A"}},{"$error":"#VALUE!"},null,{"$f":"IF(stockerendgrade=\"Medium #2\",0,(VLOOKUP($G$137,historicalprices,11)))","v":221.42},{"$f":"IF(stockerendwt>=800,0,IF(stockerendgrade=\"Medium #1\",0,IF(stockersex=\"Holstein Steers\",0,(VLOOKUP($I$137,historicalprices,11)))))","v":0},{"$error":"#VALUE!"},null,{"$error":"#VALUE!"},{"$error":"#VALUE!"},null,{"$error":"#VALUE!"}]
[null,null,{"$f":"IF(stockerbegwt<300,0,IF(stockerbeggrade=\"Medium #2\",0,IF(endmth>begmth,VLOOKUP($C$137,historicalprices,12),VLOOKUP($C$137,historicalprices,11))))","v":{"$error":"#N/A"}},{"$f":"IF(stockerbegwt<300,0,IF(stockerbeggrade=\"Medium #1\",0,IF(stockersex=\"Holstein Steers\",0,IF(endmth>begmth,VLOOKUP($E$137,historicalprices,12),VLOOKUP($E$137,historicalprices,11)))))","v":{"$error":"#N/A"}},{"$error":"#VALUE!"},null,{"$f":"IF(stockerendgrade=\"Medium #2\",0,(VLOOKUP($G$137,historicalprices,12)))","v":341.18},{"$f":"IF(stockerendwt>=800,0,IF(stockerendgrade=\"Medium #1\",0,IF(stockersex=\"Holstein Steers\",0,(VLOOKUP($I$137,historicalprices,12)))))","v":0},{"$error":"#VALUE!"},null,{"$error":"#VALUE!"},{"$error":"#VALUE!"},null,{"$error":"#VALUE!"}]
[]
[null,"10 yr avg",{"$f":"AVERAGE(C141:C150)","v":{"$error":"#N/A"}},{"$f":"AVERAGE(D141:D150)","v":{"$error":"#N/A"}},{"$f":"AVERAGE(E141:E150)","v":{"$error":"#VALUE!"}},null,{"$f":"AVERAGE(G141:G150)","v":184.40900000000005},{"$f":"AVERAGE(H141:H150)","v":0},{"$f":"AVERAGE(I141:I150)","v":{"$error":"#VALUE!"}},"10 yr avg",{"$f":"AVERAGE(K141:K150)","v":{"$error":"#VALUE!"}},{"$f":"AVERAGE(L141:L150)","v":{"$error":"#VALUE!"}},null,{"$f":"AVERAGE(N141:N150)","v":{"$error":"#VALUE!"}}]
[null,"5 yr avg",{"$f":"AVERAGE(C146:C150)","v":{"$error":"#N/A"}},{"$f":"AVERAGE(D146:D150)","v":{"$error":"#N/A"}},{"$f":"AVERAGE(E146:E150)","v":{"$error":"#VALUE!"}},null,{"$f":"AVERAGE(G146:G150)","v":231.72799999999998},{"$f":"AVERAGE(H146:H150)","v":0},{"$f":"AVERAGE(I146:I150)","v":{"$error":"#VALUE!"}},"5 yr avg",{"$f":"AVERAGE(K146:K150)","v":{"$error":"#VALUE!"}},{"$f":"AVERAGE(L146:L150)","v":{"$error":"#VALUE!"}},null,{"$f":"AVERAGE(N146:N150)","v":{"$error":"#VALUE!"}}]
[null,"1 yr avg",{"$f":"C150","v":{"$error":"#N/A"}},{"$f":"D150","v":{"$error":"#N/A"}},{"$f":"E150","v":{"$error":"#VALUE!"}},null,{"$f":"G150","v":341.18},{"$f":"H150","v":0},{"$f":"I150","v":{"$error":"#VALUE!"}},"1 yr avg",{"$f":"K150","v":{"$error":"#VALUE!"}},{"$f":"L150","v":{"$error":"#VALUE!"}},null,{"$f":"N150","v":{"$error":"#VALUE!"}}]
[]
[]
[]
[]
[null,null,null,null,"Average Selling Prices as % of Buying Price"]
[null,null,"Average BSM",null,null,null,null,"Value of Gain"]
[null,null,{"$f":"AvgBSM","v":{"$error":"#VALUE!"}},null,{"$f":"AvgSPpercBP","v":{"$error":"#VALUE!"}},null,null,{"$f":"AvgVOG","v":{"$error":"#VALUE!"}}]
[null,null,{"$f":"AvgBSM","v":{"$error":"#VALUE!"}},null,{"$error":"#VALUE!"},null,null,{"$error":"#VALUE!"}]
[null,null,{"$error":"#VALUE!"},null,{"$error":"#VALUE!"},null,null,{"$error":"#VALUE!"}]
[null,null,{"$error":"#VALUE!"},null,{"$error":"#VALUE!"},null,null,{"$error":"#VALUE!"}]
[null,null,{"$error":"#VALUE!"},null,{"$error":"#VALUE!"},null,null,{"$error":"#VALUE!"}]
[null,null,{"$error":"#VALUE!"},null,{"$error":"#VALUE!"},null,null,{"$error":"#VALUE!"}]
[null,null,{"$error":"#VALUE!"},null,{"$error":"#VALUE!"},null,null,{"$error":"#VALUE!"}]
[null,null,{"$error":"#VALUE!"},null,{"$error":"#VALUE!"},null,null,{"$error":"#VALUE!"}]
[null,null,{"$error":"#VALUE!"},null,{"$error":"#VALUE!"},null,null,{"$error":"#VALUE!"}]
[null,null,{"$error":"#VALUE!"},null,{"$error":"#VALUE!"},null,null,{"$error":"#VALUE!"}]
[null,null,{"$error":"#VALUE!"},null,{"$error":"#VALUE!"},null,null,{"$error":"#VALUE!"}]

{"sheet":"Data","index":3,"n_rows":486,"n_cols":20,"rows_kept":486,"cut":false,"hidden":true,"merged":[[15,3,15,6]]}
[]
[null,"Months dropdown list",null,null,"Sex",null,"Grade dropdown list",null,null,"State dropdown list",null,null,"Beginning Weight dropdown list",null,null,"GA Heifers dropdown list",null,null,null,"Percent M1 dropdown list"]
[null,"Jan",null,null,"Heifers",null,"Medium #1",null,null,"Georgia",null,null,"300-400",null,null,"300-400",null,null,null,0]
[null,"Feb",null,null,"Steers",null,"Medium #2",null,null,"Tennessee",null,null,"400-500",null,null,"400-500",null,null,null,5]
[null,"Mar",null,null,"Holstein Steers",null,"Mixed",null,null,null,null,null,"500-600",null,null,"500-600",null,null,null,10]
[null,"Apr",null,null,null,null,null,null,null,null,null,null,"600-700",null,null,"600-700",null,null,null,15]
[null,"May",null,null,null,null,null,null,null,"State dropdown list",null,null,"700-800",null,null,null,null,null,null,20]
[null,"Jun",null,null,null,null,null,null,null,"Georgia",null,null,null,null,null,null,null,null,null,25]
[null,"Jul",null,null,null,null,null,null,null,"Tennessee",null,null,"Ending Weight dropdown list",null,null,"TN Heifers Ending Weight dropdown list",null,null,null,30]
[null,"Aug",null,null,null,null,null,null,null,"5-Market Area Finished",null,null,"300-400",null,null,"300-400",null,null,null,35]
[null,"Sep",null,null,null,null,null,null,null,null,null,null,"400-500",null,null,"400-500",null,null,null,40]
[null,"Oct",null,null,null,null,null,null,null,null,null,null,"500-600",null,null,"500-600",null,null,null,45]
[null,"Nov",null,null,null,null,null,null,null,null,null,null,"600-700",null,null,"600-700",null,null,null,50]
[null,"Dec",null,null,null,null,null,null,null,null,null,null,"700-800",null,null,"700-800",null,null,null,55]
[null,null,null,null,null,null,null,null,null,null,null,null,"700-800 Loads",null,null,"700-800 Loads",null,null,null,60]
[null,null,null,null,null,null,null,null,null,null,null,null,"800-900 Loads",null,null,null,null,null,null,65]
[null,null,null,null,null,null,null,null,null,null,null,null,null,null,null,null,null,null,null,70]
["ID",15,16,17,18,19,20,21,22,23,24,25,null,null,"Prices Years",null,null,null,null,75]
["FINISHEDAPR",162.49,130.10536389343653,131.31,121.08828832825064,126.33,102.02,120.88066699799133,141.66,177.09,184.21,213.88,null,null,2015,null,null,null,null,80]
["FINISHEDAUG",135.29,116.45195229644524,111.83,110.36489855984183,109.38,104.6,124.45,144.07,184.85,189.39,243.14,null,null,2016,null,null,null,null,85]
["FINISHEDDEC",125.23,114.06024780106793,119.8,119.36,120,109.05,139.36000000000001,156.53,170.69,193.44,226.26,null,null,2017,null,null,null,null,90]
["FINISHEDFEB",159.74,133.91775019098549,121.54,127.94195213934721,124.88,118.59,113.89593862347209,141.32,160.88999999999999,181.1,202.6,null,null,2018,null,null,null,null,95]
["FINISHEDJAN",164.69,133.79042044257113,119.99,123.35066483748416,123.23,123.89,110.65,137.27000000000001,156.30000000000001,174.45,204.49,null,null,2019,null,null,null,null,100]
["FINISHEDJUL",148.88999999999999,117.31927149987203,118.45,112.19524864192358,112.84,96.57,122.03,142.16,184.25,194.82,237.09,null,null,2020]
["FINISHEDJUN",151.25,123.50744551191021,128.91999999999999,110.56272685090052,111.92,103.82,122.02,142.78,184.51,193.33,235.35,null,null,2021]
["FINISHEDMAR",162.86000000000001,136.71083841529347,127.36,125.52363640109485,127.69,112.48,114.39539020934993,139.16999999999999,165.56,187.55,207.96,null,null,2022]
["FINISHEDMAY",160.6,129.43945046027036,138.05000000000001,118.50484067327645,118.13,111.53,119.36,141.34,175.45,187.71,226.43,null,null,2023]
["FINISHEDNOV",125.23,108.13441461927596,121.37,115.04,115.35,108.85,133.38999999999999,153.62,178.76,187.2,221.02,null,null,2024]
["FINISHEDOCT",127.07,100.87354319653575,112.47,111.56,109.29,106.65,124.33,148.83000000000001,184.35,188.62,235.56,null,null,2025]
["FINISHEDSEP",130.84,105.90354831688916,107.11,109.91,102.27,104.06,124.05,144.04,183.71,183.56,238.64]
["GAM1HFRS34APR",303.38,172.78,145.62,148.82,151.34,101.76,143.91999999999999,160.13999999999999,221.62,304.73,382.26]
["GAM1HFRS34AUG",265.48,148.47,145.08000000000001,143.94,126.82,136.96,149.21,162.82,241.41,278.38,418.45]
["GAM1HFRS34DEC",183.79,133.93,145.34,141.09,130.06,139.15,144.35,168.49,241.29,319.27,428.32]
["GAM1HFRS34FEB",293.24,191.3,136.44999999999999,164.5,148.69,147.01,138.22,161.65,186.38,284.14,332.54]
["GAM1HFRS34JAN",287.89,196.53,135.77000000000001,150.11000000000001,143.93,145.29,137.09,154.16999999999999,171.23,262.33999999999997,342.42]
["GAM1HFRS34JUL",278.57,143.37,149.99,145.69999999999999,132.41999999999999,137.94999999999999,147.44999999999999,157.71,234.37,298.26,398.78]
["GAM1HFRS34JUN",297.29000000000002,151.94,149.87,151.13,130.69,138.46,139.66,155.15,245.08,311.86,386.64]
["GAM1HFRS34MAR",302.88,193.7,142.80000000000001,161.03,154.05000000000001,139.21,141.75,164.29,210.71,300.94,377.08]
["GAM1HFRS34MAY",299.52999999999997,161.41999999999999,151.38999999999999,151.11000000000001,143.93,138.13999999999999,136.72999999999999,158.11000000000001,229.31,305.45999999999998,397.94]
["GAM1HFRS34NOV",202.71,122.99,147.91,143.04,125.68,133.93,138.85,159.72,232.37,271.85000000000002,395.06]
["GAM1HFRS34OCT",202.28,114.01,144.26,143.85,122.64,128.93,136.31,153.19999999999999,233.31,264.76,413.58]
["GAM1HFRS34SEP",228.8,132.13,142.71,143.22,122.54,135.16999999999999,141.02000000000001,162.19,240.09,267.81,437.78]
["GAM1HFRS45APR",264.04000000000002,154.82,135.46,139.93,142.97999999999999,127.52,136.63,154.15,208.38,280.67,346.47]
["GAM1HFRS45AUG",232.01,132.66999999999999,133.03,135.83000000000001,121.5,128.19999999999999,139.24,156.27000000000001,232.46,251.02,378.19]
["GAM1HFRS45DEC",155.69,121.03,134.18,129.15,121.41,130.36000000000001,137.81,160.93,225.49,289.68,392]
["GAM1HFRS45FEB",256.16000000000003,164.91,126.4,150.28,137.44999999999999,137.63,129.32,154.31,176.56,264.20999999999998,306.72000000000003]
["GAM1HFRS45JAN",255.14,162.09,124.05,138.58000000000001,131.86000000000001,134.58000000000001,129.09,149.5,163.78,247.52,303.64999999999998]
["GAM1HFRS45JUL",241.8,129.35,136.63,136.41,126.31,129.06,139.03,150.44,224.71,268.20999999999998,361.2]
["GAM1HFRS45JUN",257.05,134.79,140.22,139.68,125.81,129.04,135.49,150.55000000000001,230.38,274.23,355.47]
["GAM1HFRS45MAR",261.98,170.77,132.47999999999999,146.86000000000001,141.94,130.94,135.13,155.69,197.44,282.56,338.57]
["GAM1HFRS45MAY",257.33,143.69,141.96,141.81,134.68,127.19,129.28,153.77000000000001,216.33,278.37,359.8]
["GAM1HFRS45NOV",175.21,111.21,135.78,129.38999999999999,120.7,125.86,132.13,151.82,223.96,253.6,367.81]
["GAM1HFRS45OCT",180.08,102.12,133.07,132.97,116.79,120.38,130.71,148.07,224.52,244.03,379.33]
["GAM1HFRS45SEP",196.2,117.77,132.85,134.29,117.44,123.79,133.47999999999999,154.72999999999999,230.73,242.66,393.81]
["GAM1HFRS56APR",234.85,142,127.82,131,135.25,118.44,128.07,146.04,194.54,257.58999999999997,315.32]
["GAM1HFRS56AUG",211.09,125.82,125.48,128.34,115.12,121.31,131.43,149.86000000000001,220.82,233.42,341.57]
["GAM1HFRS56DEC",138.91,107.67,127.36,119.08,115.42,115.95,129.30000000000001,149.46,209.99,258.35000000000002,349.48]
["GAM1HFRS56FEB",223.63,148.78,115.95,138.68,128.06,125.33,120.98,146.47999999999999,165.62,245.52,276.39999999999998]
["GAM1HFRS56JAN",225.73,145.63999999999999,113.24,130.03,123.59,124.49,118.12,140.66999999999999,155.83000000000001,228.92,271.85000000000002]
["GAM1HFRS56JUL",220.07,121.22,129.19999999999999,129.33000000000001,119.88,120.71,128.9,142.72,215.44,253.51,331.4]
["GAM1HFRS56JUN",232.25,126.61,132.22,131.03,119.47,120.8,128.62,141.38,215.18,254.18,326.31]
["GAM1HFRS56MAR",233.4,152.26,123.29,135.11000000000001,132.71,121.16,125.56,147.52000000000001,183.51,259.39,304.52]
["GAM1HFRS56MAY",232.3,134.06,135.35,132.62,127.61,119.17,121.51,144.41,202.43,256.04000000000002,329]
["GAM1HFRS56NOV",152.97,99.26,127.36,120.02,114.63,113.9,121.85,144.87,211.67,232.14,335.17]
["GAM1HFRS56OCT",161.02000000000001,92.55,123.87,123.96,108.73,113.11,122.26,138.29,212.8,223.73,344.7]
["GAM1HFRS56SEP",180.35,108.86,124.46,126.86,111.78,118.55,128.38,147,223.8,226.79,354.85]
["GAM1HFRS67APR",210.74,133.29,120.38,121.18,125.91,108.93,118.18,132.63,177.3,229.32,277.37]
["GAM1HFRS67AUG",195.09,120.25,120.4,120.74,110.42,115.4,122.04,141.88999999999999,210.16,217.03,316.82]
["GAM1HFRS67DEC",128.83000000000001,98.03,120.83,111.79,108.61,107.73,123.89,137.57,191.16,237.32,323.07]
["GAM1HFRS67FEB",201.78,137.82,109.19,128.06,121.71,114.86,111.59,137.34,153.47999999999999,225.39,251.01]
["GAM1HFRS67JAN",206.33,135.44,106.01,121.42,115.62,115.05,109.81,132.94999999999999,144.72999999999999,210.78,246.31]
["GAM1HFRS67JUL",200.55,116.97,123.96,121.95,113.48,109.12,117.62,132.28,204.72,233.36,301.81]
["GAM1HFRS67JUN",210.33,119.8,125.15,121.48,114.78,109.99,117.25,129.21,198.64,228.04,299.57]
["GAM1HFRS67MAR",208.48,140.71,115.2,125.61,125.04,110.35,116.27,136.21,167.89,233.73,264.88]
["GAM1HFRS67MAY",210.2,127.42,125.52,121.77,119.96,109.89,111.73,128.19999999999999,186.64,232.58,295.67]
["GAM1HFRS67NOV",142.78,90.67,121.08,114.1,109.3,105.05,116.32,132.68,191.44,214.45,309.89]
["GAM1HFRS67OCT",150.91,86.42,117.77,118.86,105.79,105.36,116.83,128.15,196,206.09,321.27]
["GAM1HFRS67SEP",169.61,102.33,118.12,120.11,109.63,112.09,121.95,138.46,209.61,212.81,330.21]
["GAM1HFRS78APR",198.46,124.92,115.17,113.99,119.53,99.66,111.19,122.3,164.72,206.56,250.37]
["GAM1HFRS78AUG",187.41,112.85,115.05,114.57,109.25,108.02,108.73,131.19999999999999,194.31,191.76,276.83999999999997]
["GAM1HFRS78DEC",140.172,89.04,115.51,112.43,104.8,100.86,113.95,129.55000000000001,170.96,211.63,291.39999999999998]
["GAM1HFRS78FEB",179.92,128.66999999999999,103.19,120.08,114.75,109.16,103.79,124.55,140.78,204.65,227.56]
["GAM1HFRS78JAN",195.9,131.79,99.76,115.63,107.42,115.29,99.68,121.02,134.16,191.84,224.07]
["GAM1HFRS78JUL",190.17,110.63,117.4,112.63,105.71,103.68,109.65,122.33,185.93,214.56,270.25]
["GAM1HFRS78JUN",197.48,114.44,118.08,109.24,108.52,102.88,108.43,119.36,175,208.74,254.14]
["GAM1HFRS78MAR",193.05,129.9,107.78,117.12,118.45,93.65,108.63,127.8,154.94999999999999,217.77,246.15]
["GAM1HFRS78MAY",186.81,119.69,116.73,111.65,112.22,98.98,105.61,122.33,160.66999999999999,213.54,254.13]
["GAM1HFRS78NOV",142.09,86.23,114.18,110,102.1,97.28,109.77,123.99,175.92,197.31,284.33]
["GAM1HFRS78OCT",144.63,80.989999999999995,112.1,112.33,100.03,96.93,109.49,119.56,182.43,187.28,282.72000000000003]
["GAM1HFRS78SEP",171.32,95.55,113.39,115.89,105.71,104.99,115.09,133.35,197.31,184.66,296.95999999999998]
["GAM1STRS34APR",351.87,225.11,168.67,174.86,182.07,172.33,173.79,192.52,192.52,350.12,434.71]
["GAM1STRS34AUG",306.31,172.64,170.07,185.59,152.6,167.08,180.39,199.38,199.38,320.8,471.44]
["GAM1STRS34DEC",233.39,158.24,175.32,178.68,166.98,166.3,183.76,211.14,211.14,376.71,493.01]
["GAM1STRS34FEB",360.43,227.93,162.4,194.29,181.72,183.95,168.86,204.35,204.35,353.7,404.84]
["GAM1STRS34JAN",349.13,239.15,161.58000000000001,178.8,174.12,180.02,170.63,187.28,187.28,316.37,409.61]
["GAM1STRS34JUL",303.11,160.4,173.1,173.63,153.74,162.21,183.1,190.76,190.76,351.69,453.18]
["GAM1STRS34JUN",342.28,160.56,172.26,173.26,162.38,160.83000000000001,168.76,182.53,182.53,341.6,429.1]
["GAM1STRS34MAR",363.21,228.33,165.8,189.77,183.1,166.5,173.06,198.37,198.37,360.86,439.44]
["GAM1STRS34MAY",346.69,181.67,172.53,173.95,160.44999999999999,160.26,162.11000000000001,187.87,187.87,355.55,445]
["GAM1STRS34NOV",270.12,146.38,177.07,166.04,160.82,166.24,169.96,190.81,190.81,331.49,456.7]
["GAM1STRS34OCT",243.21,133.84,177.08,172.31,153.22999999999999,154.94,167.35,191.27,191.27,309.27999999999997,475.29]
["GAM1STRS34SEP",260.45999999999998,155.52000000000001,175.64,175.87,152,162.81,171.02,202.22,202.22,313.64999999999998,486.89]
["GAM1STRS45APR",301.91000000000003,173.77,155.4,163.79,169.47,149.29,159.21,179.56,179.56,330.54,394.52]
["GAM1STRS45AUG",259.19,152.16,153.88999999999999,159.16999999999999,140.02000000000001,148.58000000000001,164.74,186.48,186.48,286.77,421.26]
["GAM1STRS45DEC",189.78,143.18,161.99,155.69,149.51,154.16,169.33,194.21,194.21,336.25,456.6]
["GAM1STRS45FEB",298.54000000000002,203.38,148.57,180.08,167.16,165.57,156.66,184.1,184.1,324.66000000000003,359.08]
["GAM1STRS45JAN",306.32,198.8,146.16,165.12,162.28,164.57,156.99,179.35,179.35,289.31,358.28]
["GAM1STRS45JUL",263.17,139.76,157.79,159.63,141.54,144.88999999999999,160.49,182.86,182.86,319.64,405.39]
["GAM1STRS45JUN",286.70999999999998,149.99,159.58000000000001,159.82,143.75,144.85,158.24,173.79,173.79,324.42,398.43]
["GAM1STRS45MAR",307.64999999999998,204.79,156.38999999999999,173.07,171.5,156.13,162.37,186.25,186.25,333.67,393.42]
["GAM1STRS45MAY",287.2,158.88999999999999,160.88999999999999,162.21,157.15,145.38999999999999,151.15,175.04,175.04,328.36,406.26]
["GAM1STRS45NOV",220.65,133.05000000000001,161.61000000000001,157.07,144.4,148.16,159.96,182.52,182.52,303.36,432.03]
["GAM1STRS45OCT",211.79,121.89,159.38,156.88,135.9,139.30000000000001,155.93,174.41,174.41,285.19,425.07]
["GAM1STRS45SEP",224.86,136.47,158.78,159.83000000000001,134.86000000000001,147.72999999999999,160.78,187.65,187.65,277.70999999999998,445.27]
["GAM1STRS56APR",265.95,156.72,142.56,150.5,159.12,137.5,145.93,167.09,167.09,302.77,362.83]
["GAM1STRS56AUG",228.81,136.99,140.02000000000001,147.93,131.08000000000001,135.59,152.34,172.43,172.43,260.95999999999998,377.98]
["GAM1STRS56DEC",156.34,126.69,148.5,138.63,134.69,136.76,154.30000000000001,176.33,176.33,298.64999999999998,400.03]
["GAM1STRS56FEB",256.49,174.75,136.97,162.49,153.19999999999999,148.76,143.97999999999999,169.95,169.95,291.83,317.55]
["GAM1STRS56JAN",256.26,169.33,131.63999999999999,151.34,146.94,149.16999999999999,137.84,164.19,164.19,258.64999999999998,314.56]
["GAM1STRS56JUL",239.83,131.71,145.96,147.52000000000001,135.6,134.08000000000001,148.83000000000001,168.08,168.08,293.54000000000002,366.22]
["GAM1STRS56JUN",259.06,138.1,149.57,150.34,135.15,136.75,146.6,161.79,161.79,297.68,363.01]
["GAM1STRS56MAR",266.70999999999998,179.56,142.12,157.69999999999999,158,143.30000000000001,146.61000000000001,173.08,173.08,304.86,352.57]
["GAM1STRS56MAY",259.3,147.88,151.75,150.72999999999999,147.49,136.44999999999999,138.72999999999999,164.38,164.38,304.07,368.22]
["GAM1STRS56NOV",176.66,119.05,148.97,142.76,132.11000000000001,133.4,145.96,168.28,168.28,274.77,395.03]
["GAM1STRS56OCT",182.64,108.35,143.58000000000001,147.01,126.16,128.36000000000001,143.66999999999999,161.66,161.66,259.69,388.39]
["GAM1STRS56SEP",199.17,120.98,139.85,146.80000000000001,127.05,131.88999999999999,146.41,170.7,170.7,253.16,395.31]
["GAM1STRS67APR",236.19,143.02000000000001,131.62,139.34,145.66,122.25,133.68,155.11000000000001,155.11000000000001,262.25,325.18]
["GAM1STRS67AUG",212.66,129.76,130.69,136.33000000000001,126.21,128.04,140.07,161.41,161.41,240.72,349.39]
["GAM1STRS67DEC",140.9,116.74,136.85,130.74,125.27,124.72,141.28,165.31,165.31,260.61,358.43]
["GAM1STRS67FEB",217.96,154.69999999999999,123.8,147.06,139.21,135.46,128.83000000000001,152.66,152.66,256.52,284.57]
["GAM1STRS67JAN",230.76,149.25,122.07,138.72999999999999,133.5,138.04,123.07,148.09,148.09,233.35,278.18]
["GAM1STRS67JUL",220.07,125.27,137.94999999999999,136.86000000000001,128.33000000000001,126.14,139.30000000000001,155.46,155.46,264.52999999999997,335.23]
["GAM1STRS67JUN",231.55,130.51,140.82,137.36000000000001,126.35,126.97,136.80000000000001,148.09,148.09,262,333.77]
["GAM1STRS67MAR",235.46,157.88,129.80000000000001,142.72,141.46,128.41999999999999,134.15,156.52000000000001,156.52000000000001,268.63,306.57]
["GAM1STRS67MAY",229.25,135.52000000000001,142.24,138.16999999999999,135.99,125.98,129.84,151.77000000000001,151.77000000000001,265.06,336.28]
["GAM1STRS67NOV",164.38,106.29,136.43,131.47999999999999,124.75,122.92,135.62,155.22,155.22,244.77,344.61]
["GAM1STRS67OCT",171.54,100.24,132.59,135.55000000000001,124.72,119.32,133.38999999999999,147.78,147.78,234.33,351.07]
["GAM1STRS67SEP",189.64,114.42,132.1,136.83000000000001,123.32,126.39,136.82,158.65,158.65,230.15,361.12]
["GAM1STRS78APR",209.45,133.22,122.12,127.1,135.44,112.75,124.93,140.76,140.76,233.75,287.29000000000002]
["GAM1STRS78AUG",198.89,122.86,123.4,129.28,116.15,122.58,130.33000000000001,153.52000000000001,153.52000000000001,228.24,325.07]
["GAM1STRS78DEC",130.61000000000001,107.68,129.69999999999999,122.83,116.99,117.91,136.34,153.16999999999999,153.16999999999999,240.49,317.18]
["GAM1STRS78FEB",192.51,136.91,114.43,134.76,128.31,127.45,123.11,143.99,143.99,229.09,252.25]
["GAM1STRS78JAN",214.61,139.53,111.07,132.38,126.53,127.11,118.6,139.13999999999999,139.13999999999999,216.99,255.49]
["GAM1STRS78JUL",200.64,119.01,128.07,125.2,123.47,117.01,128.63,143.41999999999999,143.41999999999999,236.92,297.27999999999997]
["GAM1STRS78JUN",213.68,123.9,127.22,125.81,117.96,116.79,125.26,134.47999999999999,134.47999999999999,243.93,287.75]
["GAM1STRS78MAR",196.3,144.06,119.67,129.15,130.86000000000001,113.9,125.27,143.52000000000001,143.52000000000001,237.58,278.2]
["GAM1STRS78MAY",207.8,126.83,131.21,125.28,127.84,118.1,118.81,139.63999999999999,139.63999999999999,244.39,288.63]
["GAM1STRS78NOV",156.38,99.35,128.26,124.83,121.5,111.75,124.5,144.25,144.25,220.4,312.3]
["GAM1STRS78OCT",161.21,94.71,126.62,127.51,118.5,113.27,126.34,140.57,140.57,222,320.04000000000002]
["GAM1STRS78SEP",176.01,110.14,126.48,130.21,115.53,117.11,129.33000000000001,146.86000000000001,146.86000000000001,215.29,327.24]
["HLSTRS34APR",223.4,141.9,91.96,97.35,84.24,95,127.12763636363636,112.22,183.83,275.82,295.27999999999997]
["HLSTRS34AUG",202.97,101.9,91.13,80.930000000000007,97.5,103.94,129.9,146.55000000000001,200.71,276.5,373]
["HLSTRS34DEC",144.62,70.75,94.99,60,86.11,111.13,125.44,136,197.86,250.5,341.15]
["HLSTRS34FEB",194.56,125.72,79.84,95.4,75.739999999999995,95.16,113.7,133.31,147,210,308.24]
["HLSTRS34JAN",190.44,125,77.64,69.010000000000005,73.33,93.4,108.14,116.89,141.19999999999999,199.78,265.51]
["HLSTRS34JUL",206,100.12,96.49,81.45,79.290000000000006,80.430000000000007,133.68,134.4,183.17,272.99,343]
["HLSTRS34JUN",211.23,118.53,98.79,84.65,95.22,98.06,134.88,142.18,188.37,272.14,379.41]
["HLSTRS34MAR",200.97,151.96,87.98,97.25,71.94,101.38,132.43,132.29,163.76,261.67,296.25]
["HLSTRS34MAY",220.04,127.28,99.14,107.88,97.24,106.34,128.94999999999999,132.34,188.97,262.72000000000003,358.33]
["HLSTRS34NOV",163.96,76.69,97.88,61.88,78.8,111.29,117.24,139,192.23,232.5,287.5]
["HLSTRS34OCT",169.24,80.81,80.319999999999993,77.430000000000007,83.77,111.76,119.76,138,195.79,282.7,357.13]
["HLSTRS34SEP",171.2,127.27,82.15,92,88.73,111.06,125.32,136,200,275.73,393.73]
["HLSTRS45APR",203.15,138.81,99.28,89.71,78.89,102.98,126.79,112.71,181.97,260.69,282.38]
["HLSTRS45AUG",185.21,100.8,95.78,86.46,88.3,111.8,116.16,142.83000000000001,199.48,264.18,354.52]
["HLSTRS45DEC",96.49,71.37,90.08,68.22,81.55,108.76,121.61,129.05000000000001,186.16,227.1,338.25]
["HLSTRS45FEB",162.99,123.5,76.290000000000006,91.74,67.58,93.23,105.96,132.5,150.84,202.5,301]
["HLSTRS45JAN",165.88,114.07,71.040000000000006,86.74,78.89,96.02,101.12,115.95,143.52000000000001,189.65,265.42]
["HLSTRS45JUL",182.12,107.35,95.23,88.61,84.55,94.65,118.92,137.78,178.05,252.46,329.5]
["HLSTRS45JUN",207.48,113.04,92.74,79.61,91.09,92.79,118.61,146.35,196.7,265.52,356.58]
["HLSTRS45MAR",195.62,132.91,70.55,98.82,84.84,94.29,118.94,136.68,157.22999999999999,269.79000000000002,288.33999999999997]
["HLSTRS45MAY",204.34,123.98,90.09,75.680000000000007,91.37,100.66,124.72,139.22,188.77,258.69,324.37]
["HLSTRS45NOV",148.34,89.68,96.22,68.599999999999994,80.31,121.93,126.85,138.94,195.8,244.57,318.75]
["HLSTRS45OCT",158.34,74.56,86.05,71.64,77.5,106.95,160,128.62,186.19,264.64999999999998,381.09]
["HLSTRS45SEP",156.72,122.05,75.58,91,84.07,112.03,122.78,134.11000000000001,202.85,257.32,382.67]
["HLSTRS56APR",190.1,125.36,90.24,84.8,91.69,103.38,114.89,115,183.13,234.42,306.83]
["HLSTRS56AUG",176.57,103.13,89.61,77.400000000000006,87.58,109.07,113.46,137.85,196.63,231.19,342.69]
["HLSTRS56DEC",110.83,63.16,89.22,59,80.64,108.93,118.39,131.13999999999999,168.57,216.15,338.39]
["HLSTRS56FEB",171.12,117.78,70.040000000000006,78.23,57,93.7,109.44,127.78,149.94999999999999,218.26,260.61]
["HLSTRS56JAN",175.58,117.76,68.94,85.1,66,81.93,103.78,113.06,141.03,182.44,252.56]
["HLSTRS56JUL",163.77000000000001,92.3,93.44,73,78.58,109.43,114.33,135.85,182.89,255.47,311.06]
["HLSTRS56JUN",190.57,100.55,85.89,85.38,88.69,89.81,112,141.32,184.95,250,307.13]
["HLSTRS56MAR",188.77,122.49,61,85.9,77.88,87.88,114.61,130.47,160.24,272.20999999999998,269.12]
["HLSTRS56MAY",189.84,125,85.33,81.36,87.39,93.06,113.78,134.06,188.94,230.23,301.26]
["HLSTRS56NOV",130.63999999999999,72.349999999999994,81.36,68.11,79.739999999999995,113.03,105.9,132.53,178.16,249.23,296.67]
["HLSTRS56OCT",148.69,57.52,80.16,72.23,74.97,106.2,95.11,131.26,180.65,231.02,361.4]
["HLSTRS56SEP",157.25,112.37,73.260000000000005,72.319999999999993,82.37,104.38,110.37,138.31,193.51,228.46,374.1]
["HLSTRS67APR",174.05,114,76.84,78.930000000000007,90.44,99.29,117.89,84,173.68,204.25,261]
["HLSTRS67AUG",164.79,91.8,80.94,76.930000000000007,89.5,106.08,111.67,139,177.33,216.6,332]
["HLSTRS67DEC",105.6,64.319999999999993,89.96,62.56,86.51,104.8,114.75,131.59,175.28,208.5,305.5]
["HLSTRS67FEB",163.27000000000001,113.98,71.03,88.38,68.849999999999994,96.5,109.19,124.45,143.55000000000001,213,232]
["HLSTRS67JAN",162.99,106.54,63.15,76.41,85.24,91.4,98.13,114.96,109.57,161.29,231]
["HLSTRS67JUL",175.06,100.83,85.92,68.989999999999995,84.38,102.64,112.11,130.28,164.5,252.5,298]
["HLSTRS67JUN",185.31,99.33,83.47,77.12,86.23,74.760000000000005,109,133.25,169,231.5,288]
["HLSTRS67MAR",166.57,113.28,57.5,87,70.37,90.84,83.59,131.16999999999999,154.18,233,237.21]
["HLSTRS67MAY",182.68,103.48,86.89,68.42,84.37,96.39,111.52,133.12,171.34,214.28,278]
["HLSTRS67NOV",132.88999999999999,68.599999999999994,74.569999999999993,68.3,75.58,101.94,99.84,136.25,178.62,223.73,270]
["HLSTRS67OCT",120.69,65.16,75.099999999999994,67.22,77.45,103.45,96,125.19,177.37,213.5,342.5]
["HLSTRS67SEP",145.71,104.19,66.83,74,82.72,102.49,109.56,132.87,166.5,218.58,333.06]
["HLSTRS78APR",157.82,105.25,71.349999999999994,75.86,81.900000000000006,91.5,114.89,125.79,149,189.44,234.25]
["HLSTRS78AUG",167.44,87.03,76.959999999999994,73.5,88.06,98.75,108.63,129.74,157.5,219.47,319]
["HLSTRS78DEC",104,57.82,79.489999999999995,53,83.76,95.95,103.75,134.25,152.6,156.5,279]
["HLSTRS78FEB",145.76,105.69,70.45,73,65.38,95.14,100,120.06,88.48,187,213.5]
["HLSTRS78JAN",146.5,115.56,66.52,79.11,72.8,90.75,94.94,103.67,131.88,157,217.8]
["HLSTRS78JUL",170.4,98,78.3,88.42,79.650000000000006,97.25,102.97,126.19,164,226,265]
["HLSTRS78JUN",166.26,98.58,85.06,73.98,78.56,72.930000000000007,103.17,122.64,156.5,219,284]
["HLSTRS78MAR",154.25,101.37,68.53,83.69,75,90.27,103.34,125.58,118.74,205,226.5]
["HLSTRS78MAY",164.14,98.6,70,73.72,74.489999999999995,80.5,105.25,126,156.5,206.12,242]
["HLSTRS78NOV",124.99,65.83,79.56,60.71,78.650000000000006,94.39,97.58,131.85,168.75,203.67,263]
["HLSTRS78OCT",130.27000000000001,66.59,83.04,56.71,56.67,98.41,92.88,129.44,170,204.5,303]
["HLSTRS78SEP",137.18,95.91,71.16,69,84.01,102.42,102.93,131.25,175,195,327]
["M1HFRS34APR",280.39999999999998,164.61,147.32,153.03,147.32,132.15,173.79,140.50714285714284,219.21,297.5,375.4]
["M1HFRS34AUG",249.14,144.87,139.72,146.97,128,137.08000000000001,180.39,144.19,233.58,257.08,403.82]
["M1HFRS34DEC",162.18,118.97,136.68,130.47,126.34,129.34,183.76,145.01,215.01,301.49,402.94]
["M1HFRS34FEB",262.49,180,131.68,156.25,135.53,138.58000000000001,168.86,134.34,186.51,274.89999999999998,336.82]
["M1HFRS34JAN",257.2,174.26,124.68,146.22,130.61000000000001,133.99,170.63,133.82,167.79,244.9,335.62]
["M1HFRS34JUL",255.83,137.63,142.80000000000001,148.30000000000001,130.04,132.4,183.1,141.49,231.59,288.97000000000003,383.3]
["M1HFRS34JUN",278.32,141.49,155.1,146.36000000000001,128.69999999999999,136.19,168.76,141.37,230.37,300.16000000000003,389.58]
["M1HFRS34MAR",283.99,184.07,142.63999999999999,154.94999999999999,145.71,131.68,173.06,141.08000000000001,213.84,302.11,369.07]
["M1HFRS34MAY",277.18,156.41999999999999,155.41,149.80000000000001,140,135.13999999999999,162.11000000000001,137.69,224.52,305.8,387.52]
["M1HFRS34NOV",178.74,116.21,137.86000000000001,130.41,124.13,130.11000000000001,169.96,133.91999999999999,217.52,270.75,393.27]
["M1HFRS34OCT",191.51,110.03,138.94999999999999,137.80000000000001,119.78,124.01,167.35,134.52000000000001,223.93,269.72000000000003,400.18]
["M1HFRS34SEP",209.55,124.83,140.08000000000001,146.55000000000001,121.38,132.28,171.02,138.68,235.73,257.73,411.32]
["M1HFRS45APR",250.56,152.08000000000001,139.81,143.68,143.12,125.28,159.21,135.1,207.18,273.67,344.39]
["M1HFRS45AUG",224.59,133.47,135.47,140.97999999999999,124.37,130.74,164.74,140.46,230.85,252.83,371.67]
["M1HFRS45DEC",147.86000000000001,111.8,131.15,124.01,121.96,123.78,169.33,138.27000000000001,203.71,274.3,371.82]
["M1HFRS45FEB",237.49,163.55000000000001,125.48,148.94999999999999,131.26,131.83000000000001,156.66,129.80000000000001,175.69,256.72000000000003,303.83]
["M1HFRS45JAN",235.4,156.93,118.75,140.68,125.48,128.97999999999999,156.99,126.9,161.32,233.54,305.05]
["M1HFRS45JUL",231.8,127.36,140.74,142.62,126.76,128.99,160.49,140.65,224.33,274.26,349.98]
["M1HFRS45JUN",249.24,133.46,149.28,139.91999999999999,124.62,130.06,158.24,138.1,220.52,275.67,353]
["M1HFRS45MAR",252.91,167.71,134.66999999999999,147.31,139.11000000000001,128.52000000000001,162.37,137.43,203.41,277.95999999999998,335]
["M1HFRS45MAY",248.9,146.27000000000001,147.27000000000001,142.24,137.04,127.46,151.15,132.22,211.31,276.57,353.51]
["M1HFRS45NOV",164.21,105.83,132.59,124.71,119.94,123.88,159.96,131.34,213.6,252.52,357.94]
["M1HFRS45OCT",177.28,99.93,133.13999999999999,132.63,115.96,119.3,155.93,127.5,219.57,250.52,370.77]
["M1HFRS45SEP",189.6,114.54,135.65,137.13,118.64,126.2,160.78,134.54,227.33,241.59,376.84]
["M1HFRS56APR",228.68,141.88,130.91999999999999,134.33000000000001,136.5,116.51,145.93,135.68,193.76,251.79,310]
["M1HFRS56AUG",209.97,127.25,129.62,134.16999999999999,120.19,126.78,152.34,136.82,228.91,237.81,343.72]
["M1HFRS56DEC",132.44,106.52,125.54,119.98,116.19,117.07,154.30000000000001,131.72999999999999,193.31,262.36,338.65]
["M1HFRS56FEB",215.55,149.47999999999999,117.92,138.97999999999999,125.78,125.76,143.97999999999999,121,162.91,234.12,274.5]
["M1HFRS56JAN",214.55,142.24,113.67,132.36000000000001,120.57,122.55,137.84,118.8,152.63,221.35,277.56]
["M1HFRS56JUL",216.42,122.57,134.4,135.16999999999999,122.57,122.51,148.83000000000001,135.16999999999999,218.23,252.61,326.83999999999997]
["M1HFRS56JUN",229.07,125.99,141.59,132.03,119.47,123.28,146.6,131.37,209.91,259.2,326.70999999999998]
["M1HFRS56MAR",230.35,153.68,125.87,138.72,132.44,121.02,146.61000000000001,127.38,184.94,252.22,294.88]
["M1HFRS56MAY",228.58,137.05000000000001,138.81,133.30000000000001,129.62,120.4,138.72999999999999,125.61,197.53,257.64999999999998,322.61]
["M1HFRS56NOV",153.30000000000001,99.82,127.83,121.63,115.39,117.6,145.96,124.29,204.38,234.49,328.14]
["M1HFRS56OCT",166.64,94.54,127.26,127.26,114,115.23,143.66999999999999,125.84,214.99,237.17,346.34]
["M1HFRS56SEP",179.45,108.65,129.66,131.41999999999999,114.96,121.62,146.41,129.08000000000001,221.57,230,350.01]
["M1HFRS67APR",208.02,130.63999999999999,122.69,125.16,126.83,103.16,133.68,127.89,175.18,227.34,277.75]
["M1HFRS67AUG",192.99,122.33,124.16,127.77,115.75,121.59,140.07,131.13999999999999,220.27,213.71,319.99]
["M1HFRS67DEC",122.65,102.55,120.79,113.54,113.96,113.44,141.28,126.87,180.59,231.32,326.06]
["M1HFRS67FEB",194.61,136.34,110.41,130.25,118.06,117.59,128.83000000000001,113.09,152.68,215.85,244.6]
["M1HFRS67JAN",198.6,131,106.46,125.89,115.89,116.78,123.07,112.49,142.69999999999999,200.95,248.32]
["M1HFRS67JUL",198.91,116.44,127.29,129.03,117.81,115.93,139.30000000000001,129.25,206.54,236.79,304.39999999999998]
["M1HFRS67JUN",211.73,120.59,132.56,124.17,113.11,114.3,136.80000000000001,124.3,197.9,241.34,296.27999999999997]
["M1HFRS67MAR",206.47,138.69999999999999,117.02,126.5,123.86,111.26,134.15,118.14,169.44,227.7,260.79000000000002]
["M1HFRS67MAY",207.18,128.86000000000001,131.33000000000001,123.27,119.87,111.89,129.84,117.67,185.33,233.37,288.56]
["M1HFRS67NOV",144.11000000000001,96.26,124.67,117.34,113.36,111.72,135.62,120.28,189.21,222.19,311.3]
["M1HFRS67OCT",159.26,90.04,123.94,123.52,112.12,111.38,133.38999999999999,121.8,202.06,223.66,320.45999999999998]
["M1HFRS67SEP",169.95,104.42,124.96,126.93,110.56,117.72,136.82,124.04,212.87,219.84,326.08999999999997]
["M1HFRS78APR",189.71,122.61,115.13,115.85,115.64,93.76,124.93,118.93,157.78,198.28,249.91]
["M1HFRS78APRLOAD",192.0625,130,137.5,137.94999999999999,145.6,115.33,143.87,158.19999999999999,200.83,222.3,262.13]
["M1HFRS78AUG",182.44,118.91,118.25,119.31,112.6,112.51,130.33000000000001,125.09,206.05,189.18,297.16000000000003]
["M1HFRS78AUGLOAD",200.3125,135.6,144.63999999999999,150.13,139.94,143.36000000000001,157.65,179.95,248.29,229.46,329.18]
["M1HFRS78DEC",116.89,99.29,116.1,105.68,112.17,105.71,136.34,119.63,166.81,215.22,281.02999999999997]
["M1HFRS78DECLOAD",138.25833333333333,120.5,146.25,146.41,140.88,139.78,165.64,181.35,214.02,235.78,309.77]
["M1HFRS78FEB",179.2,130.12,104.83,122.85,111.56,111.44,123.11,106.2,141.75,195.04,227.22]
["M1HFRS78FEBLOAD",173.33333333333334,130,128.41,146.83000000000001,143.37,136.32,139.27000000000001,166.23,185.92,213.4,242.43]
["M1HFRS78JAN",183.96,126.82,102.73,119.58,113.2,110.92,118.6,103.57,134.81,185,232.81]
["M1HFRS78JANLOAD",199.88333333333333,141.25,131,145.16,144.52000000000001,145.93,135.57,161.4,181.63,204.78,248.78]
["M1HFRS78JUL",188.44,113.28,121.4,120.55,110.59,104.69,128.63,118.95,191.81,211.25,270.27999999999997]
["M1HFRS78JULLOAD",194.625,127.5,152.01,151,142.30000000000001,135.34,158.16,175.47,244.94,241.69,308.68]
["M1HFRS78JUN",194.11,114.57,126.51,117.03,106.14,104.64,125.26,114.53,180.63,216.24,264.2]
["M1HFRS78JUNLOAD",209.06666666666669,132.5,147.16999999999999,144.85,136.86000000000001,132.24,151.61000000000001,171.8,234.65,234.29,287.91000000000003]
["M1HFRS78MAR",186.67,131.13999999999999,109.84,118.3,116.13,104.6,125.27,106.6,153.69,205.39,237.84]
["M1HFRS78MARLOAD",189.7,133.65,133.30000000000001,142.21,142.41999999999999,133.1,136.38,157.62,189.78,225.68,251.74]
["M1HFRS78MAY",191.07,122.5,125.98,115.32,112.13,103.07,118.81,107.49,163.74,213.49,260.18]
["M1HFRS78MAYLOAD",205.75,124.13,140.37,139.99,138.30000000000001,130.27000000000001,147.74,161.29,207.75,227.53,279.23]
["M1HFRS78NOV",136,91.95,121.85,108.47,104.81,103.12,124.5,113.59,175.82,206.21,287.63]
["M1HFRS78NOVLOAD",161.96666666666667,105.04,158.6,149.86000000000001,147.27000000000001,137.28,161.86000000000001,178.41,239.06,230.75,302.56]
["M1HFRS78OCT",150.74,88.63,119.25,117.31,106.27,105.25,126.34,112.93,186.5,205.82,314.88]
["M1HFRS78OCTLOAD",163.75,107,153.43,156.04,142.69,138.6,157.1,175.23,247.65,230.8,337.02]
["M1HFRS78SEP",163.63,102.26,118.77,121.96,103.17,109.67,129.33000000000001,115.43,198.2,203.35,307.66000000000003]
["M1HFRS78SEPLOAD",165.25,116.25,143.08000000000001,152.55000000000001,135.66999999999999,137.9,159.69,182.92,253.43,221.42,341.18]
["M1STRS34APR",316.54000000000002,183.3,168.15,176.14,173.64,159.4,177.12,191.01,255.7,338.42,425.5]
["M1STRS34AUG",277.98,161.47,157.77000000000001,166.95,150.22999999999999,160.08000000000001,169.43,199.68,268.56,293,452.3]
["M1STRS34DEC",190.5,139.18,157.22999999999999,160.47,151.56,157.9,182.44,185.94,259.77999999999997,352.7,451.16]
["M1STRS34FEB",302.47000000000003,207.04,152.36000000000001,183.08,164.15,168.64,167.62,196.37,223.12,317.72000000000003,384.78]
["M1STRS34JAN",303.57,201.21,142.65,172,156.66,163.01,162.27000000000001,189.59,203.31,290.52,386.43]
["M1STRS34JUL",284.68,151.09,159.86000000000001,164.32,153.9,154.96,167.65,182.77,268.05,322.66000000000003,424.81]
["M1STRS34JUN",314.23,156.07,171.65,161.28,149.32,159.91,167.09,187.3,261.27999999999997,333.43,427.99]
["M1STRS34MAR",328.34,208.09,163.29,179.84,173,159.16,172.5,192.14,242.58,339.78,424]
["M1STRS34MAY",315.44,171.13,174.73,168.62,168.32,160.03,166.29,192.07,256.54000000000002,343.72,444.93]
["M1STRS34NOV",202.28,132.41999999999999,162.09,155.66,148.52000000000001,156.62,169.39,181.86,258.7,322.08999999999997,440.83]
["M1STRS34OCT",221.27,127.22,160.9,159.75,143.71,146.91999999999999,163.94,178.96,261.86,313.23,452.03]
["M1STRS34SEP",236.69,139.69999999999999,164.22,167.57,143.26,155.12,166.64,191,268.16000000000003,294.33,473.27]
["M1STRS45APR",283.07,170.83,159.03,166.58,166.77,149.04,166.78,182.75,237.92,311.20999999999998,394.2]
["M1STRS45AUG",250.15,150.24,149.96,159.77000000000001,145.25,152.63999999999999,163.24,188.02,263.06,272.44,416.78]
["M1STRS45DEC",173.14,129.97999999999999,151.63,149.29,144.74,148.11000000000001,168.46,179.93,243.07,329.02,420.29]
["M1STRS45FEB",273.33999999999997,189.17,143.87,175.56,160.1,159.53,156.27000000000001,183.14,212.87,309.79000000000002,347.66]
["M1STRS45JAN",273.60000000000002,182.7,136.58000000000001,165.83,151.38,155.5,151.9,175.79,192.14,274.52,345.45]
["M1STRS45JUL",253.39,141.91999999999999,154.47999999999999,158.19999999999999,148.4,147.77000000000001,162.19999999999999,178.12,257.58,308.24,389.92]
["M1STRS45JUN",281.39999999999998,147.24,163.93,156.79,145.08000000000001,150.81,160.24,179.18,252.78,313.24,396.41]
["M1STRS45MAR",291.27999999999997,193.36,154.75,173.26,165.85,156.34,164.99,184.09,231.83,319.56,380.49]
["M1STRS45MAY",277.73,160.91,164.88,160.05000000000001,160.19,151.75,156.66999999999999,181.37,242.79,314.19,405.28]
["M1STRS45NOV",187.3,122.51,153.94,150.31,142.51,145.85,158.22999999999999,179.23,252.51,293.47000000000003,414.02]
["M1STRS45OCT",198.69,117.98,151.72999999999999,154.12,138.26,138.88999999999999,153.46,173.6,254.9,287.06,410.21]
["M1STRS45SEP",214.46,128.30000000000001,153.63,157.54,142.07,148.47999999999999,156.4,187.12,260.02,272.33999999999997,420.6]
["M1STRS56APR",255.68,160.44,149.24,154.51,159.84,137.38,153.07,170.1,226.19,287.3,357.09]
["M1STRS56AUG",229.23,140.46,142.4,150.79,139.82,143.78,156.65,176.97,251.99,256.52,380.83]
["M1STRS56DEC",155.57,121.35,142.91,141.19,137.86000000000001,136.19999999999999,156.24,168.43,227.18,288.77999999999997,383.14]
["M1STRS56FEB",238.72,173,135.66999999999999,160.34,149.5,146.22999999999999,149.77000000000001,167.42,192.71,272.91000000000003,308.61]
["M1STRS56JAN",241.86,165.86,129.97999999999999,152.43,144.06,141.88999999999999,138.47,162.03,178.18,257.2,309.86]
["M1STRS56JUL",233.74,134.33000000000001,148.53,151.77000000000001,143.05000000000001,139.61000000000001,153.99,168.74,246,286.87,365.03]
["M1STRS56JUN",252.58,141.07,156.01,149.91999999999999,138.31,141.57,149.33000000000001,165.07,241.97,291.62,363.4]
["M1STRS56MAR",258.42,177.72,145.06,160.37,154.77000000000001,140.66,147.44999999999999,170.91,215.68,290.37,336.2]
["M1STRS56MAY",251.57,151.79,155.76,152.58000000000001,153.30000000000001,141.35,143.88,169.14,228.13,293.87,363.32]
["M1STRS56NOV",175.12,116.15,145.41,141.66,134.85,134.63,147.16,165.13,240.47,265.73,373.97]
["M1STRS56OCT",185.45,109.69,143.63,147.11000000000001,132.74,130.63,144.34,161.07,246.39,260.24,380.32]
["M1STRS56SEP",199.07,122,144.19999999999999,150.22,134.07,138.19,145.58000000000001,173.52,248.65,252.98,383.41]
["M1STRS67APR",228.74,147.96,139.07,142.69999999999999,145.56,123.7,139.77000000000001,154.07,206.97,261.41000000000003,317.45999999999998]
["M1STRS67AUG",213.28,135.47,137.31,143.15,135.28,136.18,150.12,169.07,244.8,241.17,353.26]
["M1STRS67DEC",143.36000000000001,116.45,137.11000000000001,132.12,130.32,128.21,145.57,160.72999999999999,209.89,265.77999999999997,347.1]
["M1STRS67FEB",218.98,157.34,125.45,147.82,137.62,132.94999999999999,130.12,153.03,181.25,247.15,276.44]
["M1STRS67JAN",220.69,152.55000000000001,122.78,141.29,135.52000000000001,133.19999999999999,126.78,149,164.56,229.55,280.39]
["M1STRS67JUL",218.08,129.02000000000001,142.01,143.02000000000001,136.44999999999999,133.77000000000001,146.13999999999999,161.81,236.9,264.08999999999997,338.9]
["M1STRS67JUN",233.15,135.08000000000001,147.74,139.94,130.62,130.87,139.5,155.91999999999999,227.56,272.43,330.9]
["M1STRS67MAR",229.55,159.94,133.01,146.43,142.54,130.68,134.80000000000001,155.36000000000001,196.94,262.12,299.14]
["M1STRS67MAY",231.11,142.15,147.06,141.28,141.24,129.79,133.63999999999999,156.33000000000001,213.45,268.33,329.31]
["M1STRS67NOV",163.34,110.7,139.83000000000001,134.87,129.69999999999999,127.54,138.69999999999999,155.11000000000001,219.95,248.82,344.07]
["M1STRS67OCT",173.07,105.89,139.28,139.41999999999999,126.79,126.6,138.15,153.81,231.19,245.51,354.84]
["M1STRS67SEP",186.95,117.98,139.83000000000001,142.07,128.72,131.13999999999999,139.22999999999999,164.58,239.18,238.16,358.35]
["M1STRS78APR",208.36,138.02000000000001,129.01,129.13999999999999,132.75,109.38,130.38999999999999,143.05000000000001,184.33,235.43,290.36]
["M1STRS78APRLOAD",207.5,153.58000000000001,133.75,137.24,145.80000000000001,110.57,138.16999999999999,157.72,197.89,236.88,278.38]
["M1STRS78AUG",201.67,131.72999999999999,131.53,134.79,129.33000000000001,131.61000000000001,143.13999999999999,160.13,236.21,219.86,331.57]
["M1STRS78AUGLOAD",217.87,144.31,147.25,149.25,134.19999999999999,143.55000000000001,159.19999999999999,180.73,248.42,257.38,362.95]
["M1STRS78DEC",130.47,111.13,130.9,124.17,126.46,121.52,142.19999999999999,156.97999999999999,191.45,243.94,322.98]
["M1STRS78DECLOAD",148.08000000000001,128,154.62,145.21,140.96,140.36000000000001,165.54,181.6,215.9,270.75,349.5]
["M1STRS78FEB",194,144.93,116.2,138.81,129.35,125.19,125.5,145.61000000000001,165.18,226.03,249.76]
["M1STRS78FEBLOAD",182.5,143.88,122.85,146.72,143.19,137.41999999999999,138.82,165.94,185.71,232.71,255.83]
["M1STRS78JAN",206.14,144.21,116.79,132.91,129.26,126.17,118.35,140.35,158.5,213.46,258.27999999999997]
["M1STRS78JANLOAD",232.35,158.5,131.25,146.85,146.87,146.82,136.22999999999999,161.93,181.1,228.89,271.64]
["M1STRS78JUL",203.66,123.64,136.41999999999999,135.63,127.66,123.69,138.47,149.71,224.85,243.97,315.89]
["M1STRS78JULLOAD",222.17,139.62,149.68,150.66999999999999,142.54,134.52000000000001,157.05000000000001,178.27,246.8,266.38,338.22]
["M1STRS78JUN",216.06,127.22,139.88999999999999,133.09,121.68,121.73,130.02000000000001,142.16,209.98,251.21,304.29000000000002]
["M1STRS78JUNLOAD",207,135.6,146.13,146,137.04,127.34,150.19999999999999,174.06,234.81,253.94,326.02999999999997]
["M1STRS78MAR",207.15,148.12,122.26,134.85,131.57,118.12,122.42,142.26,181.51,238.53,268.54000000000002]
["M1STRS78MARLOAD",201.62,145,116.27,140.44999999999999,142.29,133.51,137.52000000000001,156.16,189.94,251.25,284.10000000000002]
["M1STRS78MAY",211.67,135.51,138.18,130.82,128.33000000000001,116.72,125.14,142.61000000000001,192.47,240.23,297.36]
["M1STRS78MAYLOAD",210.26,134.25,144.55000000000001,139.99,142.27000000000001,127.5,144.19,165.89,202.52,241.5,310.75]
["M1STRS78NOV",155.66,108.15,136.5,126.97,132.94999999999999,120.31,133.5,146.19999999999999,206.39,232.75,319.04000000000002]
["M1STRS78NOVLOAD",169.43,119.42,156.35,149.91999999999999,145.96,137.49,159.21,177.58,239.92,249.25,326.55]
["M1STRS78OCT",167.35,101.78,133.27000000000001,133.72999999999999,123.32,124.32,133.37,149.69999999999999,220.86,228.54,335.96]
["M1STRS78OCTLOAD",174.75,120.23,153.91999999999999,155.97,142.81,139.01,156.28,175.44,244.5,246.88,376.63]
["M1STRS78SEP",177.41,116.69,134.75,135.91,121.82,124.87,132.76,153.94999999999999,228.91,220.77,338.89]
["M1STRS78SEPLOAD",196.28,128.25,143.08000000000001,154.18,136.15,138.11000000000001,159.38999999999999,181.71,252.92,241.49,354.5]
["M1STRS89APRLOAD",201.84,139.01,135.41,138.13,145.75,116.8,145.41,157.16999999999999,200.75,231.05,275.89999999999998]
["M1STRS89AUGLOAD",202.03,139.05000000000001,146.85,149.34,136.36000000000001,143.30000000000001,158.58000000000001,179.73,248.02,237.52,342.22]
["M1STRS89DECLOAD",144.96,124.53,145.99,146.12,140.88,140.15,165.41,181.82,214.35,246.78153846153845,328.47]
["M1STRS89FEBLOAD",185.42,140.21,123.67,146.97,143.85,138.37,139.32,166.26,185.84,222.75,258.74]
["M1STRS89JANLOAD",208.87423076923076,147.47,131.07,145.81,144.34,146.07,136.08000000000001,161.97999999999999,181.74,215.65,260.38]
["M1STRS89JULLOAD",208.89,135.15,148.58000000000001,151.81,142.28,136.58000000000001,158.25,176.79,245.94,246.48,319.14999999999998]
["M1STRS89JUNLOAD",211.09,138.86000000000001,150.91999999999999,147.54,137.43,132.5,152,172.67,239.01,247.22,299.33999999999997]
["M1STRS89MARLOAD",194.33,141.75,128.03,142.19,143.13999999999999,128.72999999999999,138.11000000000001,156.6,189.61,234.14,270.85000000000002]
["M1STRS89MAYLOAD",211.66,137.25,143.51,137.35,137.41999999999999,127.5,134.9,160.62,216.51,236.81,284.45999999999998]
["M1STRS89NOVLOAD",170.98,124.23,158.24,150.22999999999999,146.38,137.52000000000001,158.02000000000001,178.12,232.8,242.7,327.86]
["M1STRS89OCTLOAD",172.91,116.1,153.52000000000001,156.80000000000001,142.72999999999999,140.47999999999999,157.72999999999999,175.63,246.81,242.55,347.33]
["M1STRS89SEPLOAD",184.85,128.19999999999999,146.33000000000001,152.85,137.41,137.71,158.16,181.68,253.61,231.45,350.85]
["M2HFRS34APR",258.87,152.30000000000001,135.94999999999999,142.72,139.43,123.8,139.52454545454546,139.52454545454546,199.97,271.39,344.98]
["M2HFRS34AUG",219.82,130.96,128.4,135.61000000000001,122.54,131.08000000000001,135.66999999999999,135.66999999999999,218.75,218.74,364.6]
["M2HFRS34DEC",142.72,107.21,128.38999999999999,120.56,117.01,119.14,133.24,133.24,197.62,277.97000000000003,364.2]
["M2HFRS34FEB",242.17,163.96,120.8,143.59,130.78,130.29,125.96,125.96,169.87,248.2,307.52]
["M2HFRS34JAN",237.27,157.21,112.58,134.15,122.53,117.51,125.68,125.68,154.16999999999999,225.53,301.26]
["M2HFRS34JUL",233.77,125.06,132.18,134.41,123.26,128.16,133.88,133.88,213.74,263.5,338.93]
["M2HFRS34JUN",249.36,130.18,143.80000000000001,135.24,121.12,128.79,134.94,134.94,214.1,275.27,348.23]
["M2HFRS34MAR",255.6,169.31,132.09,145.84,135.94,130.05000000000001,131.16,131.16,203.51,277.76,329.05]
["M2HFRS34MAY",249.83,145.80000000000001,142.6,138.69,132.08000000000001,126.49,129.91999999999999,129.91999999999999,207.01,282.27,356.06]
["M2HFRS34NOV",161.13,102.03,127.48,121.98,115.94,118.11,125.99,125.99,202.72,250.37,350.72]
["M2HFRS34OCT",171.64,96.87,127.9,127.28,114.28,117.99,123.38,123.38,203.15,249.52,352.48]
["M2HFRS34SEP",192.45,112.18,125.6,133.74,114.01,122.77,130.72999999999999,130.72999999999999,217.54,240.66,372.69]
["M2HFRS45APR",233.86,141.5,129.74,135.4,134.47,114.26,135.18,135.18,189.99,255.82,319.05]
["M2HFRS45AUG",207.38,122.73,124.44,130.21,117.3,122.44,126.23,126.23,214.71,227.82,341.74]
["M2HFRS45DEC",130.1,102.55,120.87,115.84,113.68,117.44,130.81,130.81,188.73,254.14,336.26]
["M2HFRS45FEB",218.87,151.13999999999999,114.94,137.87,124.07,122.55,121.46,121.46,162.51,236.53,265]
["M2HFRS45JAN",220.39,142.83000000000001,108.34,131.08000000000001,117.89,116.23,119.48,119.48,152.16,221.29,273.64]
["M2HFRS45JUL",217.71,118.59,127.69,132.38,119.96,122.15,133.27000000000001,133.27000000000001,209.11,254.78,326.10000000000002]
["M2HFRS45JUN",231.59,121.81,138.37,130.55000000000001,118.5,122.85,128.5,128.5,208.31,253.74,332.93]
["M2HFRS45MAR",232.11,154.88,126.45,137.66,130.4,121.33,126.71,126.71,172.11,255.27,294.36]
["M2HFRS45MAY",233.06,137.41,137.88,133.51,127.74,120.56,126.92,126.92,196.97,256.81,329.65]
["M2HFRS45NOV",149.71,94,123.94,116.84,111.42,115.47,120.53,120.53,198.16,234.7,334.36]
["M2HFRS45OCT",161.97999999999999,88.43,123.12,122.8,111.48,112.08,160,160,202.03,235.88,341.93]
["M2HFRS45SEP",174.34,105.01,125.19,127.26,111.06,117.63,126.55,126.55,211.24,229.07,347.17]
["M2HFRS56APR",214.7,132.74,122,126.75,127.36,106.17,126.87,126.87,174.02,231.64,287.18]
["M2HFRS56AUG",193.61,117.95,119.89,125.59,114.04,119.59,126.97,126.97,205.79,205.89,320.83]
["M2HFRS56DEC",120.64,96.2,115.77,109.95,106.81,110.55,121.64,121.64,177.48,232.77,317.18]
["M2HFRS56FEB",202.57,138.49,107.87,127.31,119.02,116.54,113.05,113.05,149.09,219.32,247.51]
["M2HFRS56JAN",198.17,131.53,101.12,121.62,112.26,121.64,109.24,109.24,139.19999999999999,204.23,252.84]
["M2HFRS56JUL",205.09,113.63,124.31,125.6,115.62,114.47,128.46,128.46,202.78,236.52,304.42]
["M2HFRS56JUN",217.51,116.06,131.78,122.19,114.34,115.18,121.84,121.84,195.64,239.53,307.10000000000002]
["M2HFRS56MAR",211.32,143.12,118.5,129.13999999999999,122.93,115.23,117.8,117.8,170.13,232.21,264.04000000000002]
["M2HFRS56MAY",216.28,128.28,130.4,123.68,120.91,112.8,119.84,119.84,178.94,238.83,305.08999999999997]
["M2HFRS56NOV",139.57,89,118.15,113.67,108.36,108.89,113.19,113.19,189.85,218.19,305.16000000000003]
["M2HFRS56OCT",153.56,83.46,116.9,118.37,108.13,105.74,114.57,114.57,193.99,215.47,317.83]
["M2HFRS56SEP",166.9,98.77,119.67,124,107.54,113.47,119.38,119.38,206.02,215.84,324.89999999999998]
["M2HFRS67APR",190.41,124.45,110.85,116.97,117.96,96.89,113.53,113.53,153.91,214.28,255.58]
["M2HFRS67AUG",175.89,111.7,114.87,118.76,108.73,110.52,119.85,119.85,195.43,199.55,293.3]
["M2HFRS67DEC",114.88,92.92,111.36,101.68,105.09,102.21,113.45,113.45,164.51,221.87,282.88]
["M2HFRS67FEB",178.92,126.12,100.22,119.61,110.49,111.47,101.5,101.5,140.87,198.74,228.01]
["M2HFRS67JAN",182.26,123.78,97.13,116.95,103.71,120.92,103.13,103.13,130.63,192.27,231.62]
["M2HFRS67JUL",186.24,107.35,117.12,119.43,111.3,106.74,119.72,119.72,196.31,220.51,279.79000000000002]
["M2HFRS67JUN",198.11,109.39,120.81,116.7,106.91,108.93,115.61,115.61,183.54,225.38,274.22000000000003]
["M2HFRS67MAR",189.94,130.5,106.63,118.72,115.2,109.55,106.93,106.93,162.52000000000001,211.52,237.07]
["M2HFRS67MAY",193.89,119.62,121.17,115.57,114.34,102.75,109.69,109.69,167.58,218.36,269.26]
["M2HFRS67NOV",132.41,86.88,112.97,104.42,102.89,102.1,105.92,105.92,169.07,200.69,278.38]
["M2HFRS67OCT",146.54,80.63,113.49,111.48,104.37,98.93,105.47,105.47,179.68,206.37,294.52999999999997]
["M2HFRS67SEP",159.16,94.42,114.55,119.26,104.05,108.54,114.83,114.83,192.65,203.13,303.12]
["M2HFRS78APR",180.22,115.54,103.69,107.43,109.47,87.74,108.53,108.53,140.38999999999999,184.57,220.69]
["M2HFRS78AUG",171.14,110.76,105.39,113.92,101.53,104.69,110.49,110.49,181.85,199.29,272.13]
["M2HFRS78DEC",110.73,88.27,103.39,99.66,93.57,92.29,115.85,115.85,145.54,196.16,268.82]
["M2HFRS78FEB",168.21,122.96,93.89,113.96,102.64,99.8,94.95,94.95,129.27000000000001,176.25,209.51]
["M2HFRS78JAN",172.66,117.41,91.26,109.88,102.66,115.63,96.48,96.48,126.34,166.28,210.22]
["M2HFRS78JUL",173.2,104.04,106.5,107.68,101.11,97.46,111.53,111.53,184.2,191.08,253.55]
["M2HFRS78JUN",181.89,106.67,111.86,108.89,101.29,101.24,105.66,105.66,158.69,195.48,242.38]
["M2HFRS78MAR",175.86,121.78,96.5,108.42,106.96,99.98,99.25,99.25,144.4,181.82,202.07]
["M2HFRS78MAY",178.88,113.48,117.49,107.28,106.05,91.53,98.87,98.87,147.08000000000001,172.93,236.27]
["M2HFRS78NOV",121.1,82.16,107.74,98.89,116.44,91.68,105.73,105.73,149.53,185.54,258.08]
["M2HFRS78OCT",141.46,78.97,109.41,106.56,97.81,92.73,100.9,100.9,165.12,187.35,264.75]
["M2HFRS78SEP",142.34,90,104.58,112.18,95.03,102.37,104.3,104.3,175.66,183.11,278.77]
["M2STRS34APR",291.01,172.01,153.68,162.41,161.87,141.61000000000001,160.69,174.19,227.76,300.58999999999997,389.98]
["M2STRS34AUG",250.08,144.82,143.41999999999999,152.87,139.13999999999999,144.22999999999999,155.18,178.11,243.98,221.43,399.78]
["M2STRS34DEC",168.74,124.1,146.96,142.1,137.34,143.46,161.62,167.88,230.22,318.3,414.23]
["M2STRS34FEB",278.18,189.54,137.13,166.58,151.52000000000001,152.29,165.03,174.26,195.31,279.31,343.01]
["M2STRS34JAN",282.63,182.82,129.25,155.04,141.55000000000001,133,148.81,163.75,179.53,257.77999999999997,318.43]
["M2STRS34JUL",262.51,137.72999999999999,147.07,150.36000000000001,138.12,141.86000000000001,152.68,167.54,242.66,286.54000000000002,384.78]
["M2STRS34JUN",287.25,145.43,155.86000000000001,151.16999999999999,139.19,146.80000000000001,150.54,170.77,240.63,299.95,387.95]
["M2STRS34MAR",300.02,190.69,147.21,167.37,156.41999999999999,150,154.80000000000001,173.72,220.31,310.82,363.59]
["M2STRS34MAY",287.05,162.15,161.36000000000001,158.35,156.56,149.03,152.28,180.81,231.79,308.69,369.16]
["M2STRS34NOV",181.24,117.39,147.72,141.22999999999999,135.94999999999999,140.01,150.12,165.61,233.94,286.19,393.5]
["M2STRS34OCT",197.25,113.52,144.31,147.41,131.15,133.58000000000001,145.69,163.86,233.11,282.33999999999997,399.7]
["M2STRS34SEP",220.43,127.51,145.28,148.91,130.08000000000001,140.53,160.21,174.35,242.47,267.25,423.72]
["M2STRS45APR",258.41000000000003,159.53,144.78,154.05000000000001,153.63999999999999,137.07,157.81,170.02,218.28,281.77999999999997,358.65]
["M2STRS45AUG",229.67,135.94999999999999,135.79,146.94,136.79,141.1,151.5,174.27,237.95,226.79,385.11]
["M2STRS45DEC",152.49,115.26,139.49,137,134.96,141.79,153.32,164.69,221.92,300.13,385.95]
["M2STRS45FEB",242.8,173.17,129.94999999999999,159.86000000000001,144.97999999999999,145.38999999999999,155.88999999999999,169.5,187.88,264.2,303.13]
["M2STRS45JAN",248.67,164.66,121.1,150.41,138.4,141.31,142.12,163.27000000000001,175.03,247.7,300.52]
["M2STRS45JUL",233.69,128.31,139.91999999999999,146.41999999999999,139.85,135.76,147.91,162.49,236.6,272.43,368.2]
["M2STRS45JUN",257.33,134.07,154.32,144.83000000000001,133.58000000000001,141.27000000000001,144.69999999999999,168.74,231.01,276.39999999999998,362.34]
["M2STRS45MAR",256.33,174.99,141.16999999999999,160.21,151.13999999999999,143.47999999999999,149.16,171.16,211.44,288.85000000000002,324.99]
["M2STRS45MAY",253.57,151.09,152.84,150.13,147.81,140.66999999999999,146.85,171.24,222.37,283.52,368.05]
["M2STRS45NOV",167.07,107.66,139.43,135.1,132.78,135.69999999999999,144.13999999999999,158.54,230.47,274.01,379.12]
["M2STRS45OCT",178.18,104.32,139.32,139.56,130.69,127.68,160,162.49,235.09,265.64,377.25]
["M2STRS45SEP",193.01,116.85,137.33000000000001,143.99,130.63,133.41,143.1,167.02,241.71,254.13,375.72]
["M2STRS56APR",235.9,149.66999999999999,136.91999999999999,142.78,152.26,125.18,145.30000000000001,157.06,202.3,259.32,328.35]
["M2STRS56AUG",212.87,128.62,130.68,139.49,133.18,134.01,140.56,162.49,228.62,220.66,359.92]
["M2STRS56DEC",139.62,109.17,132.69999999999999,128.12,126.82,125.88,135.02000000000001,149.25,211.5,270.57,338]
["M2STRS56FEB",225.33,157.94,122.48,145.30000000000001,135.18,134.29,140.31,153.93,170.93,248.93,274.99]
["M2STRS56JAN",228.46,154,114.9,137.61000000000001,132.57,139.41999999999999,129.01,145.69,162.93,228.02,275.77999999999997]
["M2STRS56JUL",221.42,121.82,135.25,139.13,135.75,130.25,140.6,154.97,229.95,260.88,337.19]
["M2STRS56JUN",232.65,128.47,144.63,134.59,128.51,129.69999999999999,139.11000000000001,151.43,218.24,262.86,337.32]
["M2STRS56MAR",232.62,163.21,131.85,148.04,141.22,139.04,138.21,161.77000000000001,192.35,263.57,293.99]
["M2STRS56MAY",233.88,143.30000000000001,144.57,138.16,142.52000000000001,128.74,137.05000000000001,160.58000000000001,210.04,262.83,330.53]
["M2STRS56NOV",159.72,101.08,132.4,126.57,126.3,125.51,135.19,149,213.14,245.72,341.97]
["M2STRS56OCT",172.52,97.52,130.18,134.97999999999999,124.33,121.4,132.06,149.16,223.38,240.88,350.9]
["M2STRS56SEP",183.76,112.77,131.63999999999999,137.68,124.46,128.49,136.79,156.85,231.97,235.46,356.17]
["M2STRS67APR",214.89,136.37,127.87,131.33000000000001,135.84,112.5,122.68,143.05000000000001,186.2,235.22,291.08999999999997]
["M2STRS67AUG",195.65,121.98,124.53,132,130.65,128.47,134.38,155.12,218.91,215.29,337.64]
["M2STRS67DEC",129.21,100.82,127.12,119.42,122.39,119.91,130.82,141.31,189.71,248.71,324.76]
["M2STRS67FEB",201.29,142.81,113.44,134.76,123.14,125.34,120.68,141.25,160.58000000000001,225.09,346.48]
["M2STRS67JAN",201.21,139.32,109.98,127.4,121.27,130.54,141.4,136.57,151.34,210.47,251.94]
["M2STRS67JUL",203.96,117.96,127.03,129.94999999999999,132.41,122.4,128.69,147.19999999999999,219.74,247.59,314.07]
["M2STRS67JUN",220.76,121.71,138.63,127.31,121.98,122.31,128.69999999999999,142.66999999999999,205.83,250.64,310.11]
["M2STRS67MAR",214.81,148.86000000000001,124.83,133.57,130.06,122.94,129.83000000000001,141.25,178.24,234.44,270.95999999999998]
["M2STRS67MAY",208.81,131.99,133.24,129.72999999999999,132.18,118.61,128.66,144.47999999999999,194.96,241.32,306.37]
["M2STRS67NOV",150.15,99.77,128.11000000000001,122.17,125.15,116.72,126.51,144.19999999999999,201.95,235.57,315.95]
["M2STRS67OCT",159.12,93.79,127.06,128.34,121.96,116.43,129.47,142.72,217.93,229.9,332.83]
["M2STRS67SEP",173.64,105.92,125.12,133.18,118.89,123.25,127.38,150.05000000000001,216.91,223.08,334.74]
["M2STRS78APR",200.8,127.19,116.06,118.69,123.97,100.13,123.03,133.55000000000001,175.19,212.11,262.73]
["M2STRS78AUG",187.7,117.78,121.73,121.63,117.48,121.24,131.56,150.13999999999999,205.61,198,307.04000000000002]
["M2STRS78DEC",121.24,102.17,113.8,115.81,117.98,116.26,127.68,134.84,179.36,227.09,299.16000000000003]
["M2STRS78FEB",179.71,134.07,103.51,125.98,117.29,118.59,120.8,133.36000000000001,150.32,209.78,221.25]
["M2STRS78JAN",181.91,133.59,103.94,119.49,114.16,120.77,110.53,134.26,147.09,193.94,236.16]
["M2STRS78JUL",195.56,117.64,121.35,121.14,123.05,114.68,128.16999999999999,143.27000000000001,213.22,220.73,295.64999999999998]
["M2STRS78JUN",201.64,118.76,125.79,121.03,116.99,115.71,117.57,134.88,189.61,214.56,278.04000000000002]
["M2STRS78MAR",184.54,136.78,112.38,124.18,119.93,109.99,114.76,136.93,168.01,214.89,251.28]
["M2STRS78MAY",202.45,124.93,121.16,116.67,118.95,110.62,116.19,140.75,177.67,219.22,271.89]
["M2STRS78NOV",140.63999999999999,97.35,122.32,116.15,116.26,112.37,119.62,139.25,195.41,219.42,294.63]
["M2STRS78OCT",151.31,92.25,119.4,120.7,119.01,115.64,125.62,143.41999999999999,200.42,214.26,314.48]
["M2STRS78SEP",165.55,101.26,117.88,124.94,114.76,121.89,124.28,147.05000000000001,206.5,208.74,321.17]

{"sheet":"Sheet1","index":4,"n_rows":264,"n_cols":57,"rows_kept":264,"cut":false,"hidden":true,"merged":[]}
[]
[null,null,null,"Georgia Auctions - Monthly"]
[null,null,null,null,null,null,null,null,null,null,null,null,null,null,null,4,"M1HFRS34APR",375.4,null,4,"M2HFRS34APR",344.98,null,4,"FINISHEDAPR",213.88,null,4,"HLSTRS34APR",295.27999999999997]
[null,null,null,null,null,null,null,null,null,null,null,null,null,null,null,8,"M1HFRS34AUG",403.82,null,8,"M2HFRS34AUG",364.6,null,8,"FINISHEDAUG",243.14,null,8,"HLSTRS34AUG",373]
[null,null,"Steers",null,null,null,null,null,"Heifers",null,null,null,null,null,null,12,"M1HFRS34DEC",402.94,null,12,"M2HFRS34DEC",364.2,null,12,"FINISHEDDEC",226.26,null,12,"HLSTRS34DEC",341.15]
[null,null,"Medium & Large 1-2",null,null,null,null,null,"Medium & Large 1-2",null,null,null,null,null,null,2,"M1HFRS34FEB",336.82,null,2,"M2HFRS34FEB",307.52,null,2,"FINISHEDFEB",202.6,null,2,"HLSTRS34FEB",308.24]
[null,null,"300-400","400-500","500-600","600-700","700-800",null,"300-400","400-500","500-600","600-700","700-800",null,null,1,"M1HFRS34JAN",335.62,null,1,"M2HFRS34JAN",301.26,null,1,"FINISHEDJAN",204.49,null,1,"HLSTRS34JAN",265.51]
[null,"Jan",409.61,358.28,314.56,278.18,255.49,null,342.42,303.64999999999998,271.85000000000002,246.31,224.07,null,null,7,"M1HFRS34JUL",383.3,null,7,"M2HFRS34JUL",338.93,null,7,"FINISHEDJUL",237.09,null,7,"HLSTRS34JUL",343]
[null,"Feb",404.84,359.08,317.55,284.57,252.25,null,332.54,306.72000000000003,276.39999999999998,251.01,227.56,null,null,6,"M1HFRS34JUN",389.58,null,6,"M2HFRS34JUN",348.23,null,6,"FINISHEDJUN",235.35,null,6,"HLSTRS34JUN",379.41]
[null,"Mar",439.44,393.42,352.57,306.57,278.2,null,377.08,338.57,304.52,264.88,246.15,null,null,3,"M1HFRS34MAR",369.07,null,3,"M2HFRS34MAR",329.05,null,3,"FINISHEDMAR",207.96,null,3,"HLSTRS34MAR",296.25]
[null,"Apr",434.71,394.52,362.83,325.18,287.29000000000002,null,382.26,346.47,315.32,277.37,250.37,null,null,5,"M1HFRS34MAY",387.52,null,5,"M2HFRS34MAY",356.06,null,5,"FINISHEDMAY",226.43,null,5,"HLSTRS34MAY",358.33]
[null,"May",445,406.26,368.22,336.28,288.63,null,397.94,359.8,329,295.67,254.13,null,null,11,"M1HFRS34NOV",393.27,null,11,"M2HFRS34NOV",350.72,null,11,"FINISHEDNOV",221.02,null,11,"HLSTRS34NOV",287.5]
[null,"Jun",429.1,398.43,363.01,333.77,287.75,null,386.64,355.47,326.31,299.57,254.14,null,null,10,"M1HFRS34OCT",400.18,null,10,"M2HFRS34OCT",352.48,null,10,"FINISHEDOCT",235.56,null,10,"HLSTRS34OCT",357.13]
[null,"Jul",453.18,405.39,366.22,335.23,297.27999999999997,null,398.78,361.2,331.4,301.81,270.25,null,null,9,"M1HFRS34SEP",411.32,null,9,"M2HFRS34SEP",372.69,null,9,"FINISHEDSEP",238.64,null,9,"HLSTRS34SEP",393.73]
[null,"Aug",471.44,421.26,377.98,349.39,325.07,null,418.45,378.19,341.57,316.82,276.83999999999997,null,null,4,"M1HFRS45APR",344.39,null,4,"M2HFRS45APR",319.05,null,null,null,null,null,4,"HLSTRS45APR",282.38]
[null,"Sep",486.89,445.27,395.31,361.12,327.24,null,437.78,393.81,354.85,330.21,296.95999999999998,null,null,8,"M1HFRS45AUG",371.67,null,8,"M2HFRS45AUG",341.74,null,4,"GAM1STRS34APR",434.71,null,8,"HLSTRS45AUG",354.52]
[null,"Oct",475.29,425.07,388.39,351.07,320.04000000000002,null,413.58,379.33,344.7,321.27,282.72000000000003,null,null,12,"M1HFRS45DEC",371.82,null,12,"M2HFRS45DEC",336.26,null,8,"GAM1STRS34AUG",471.44,null,12,"HLSTRS45DEC",338.25]
[null,"Nov",456.7,432.03,395.03,344.61,312.3,null,395.06,367.81,335.17,309.89,284.33,null,null,2,"M1HFRS45FEB",303.83,null,2,"M2HFRS45FEB",265,null,12,"GAM1STRS34DEC",493.01,null,2,"HLSTRS45FEB",301]
[null,"Dec",493.01,456.6,400.03,358.43,317.18,null,428.32,392,349.48,323.07,291.39999999999998,null,null,1,"M1HFRS45JAN",305.05,null,1,"M2HFRS45JAN",273.64,null,2,"GAM1STRS34FEB",404.84,null,1,"HLSTRS45JAN",265.42]
[null,null,null,"",null,"",null,"",null,"",null,null,null,null,null,7,"M1HFRS45JUL",349.98,null,7,"M2HFRS45JUL",326.10000000000002,null,1,"GAM1STRS34JAN",409.61,null,7,"HLSTRS45JUL",329.5]
[null,null,null,null,null,null,null,"",null,"",null,"",null,null,null,6,"M1HFRS45JUN",353,null,6,"M2HFRS45JUN",332.93,null,7,"GAM1STRS34JUL",453.18,null,6,"HLSTRS45JUN",356.58]
[null,null,null,null,null,null,null,null,null,null,null,null,null,null,null,3,"M1HFRS45MAR",335,null,3,"M2HFRS45MAR",294.36,null,6,"GAM1STRS34JUN",429.1,null,3,"HLSTRS45MAR",288.33999999999997]
[null,null,2015,2016,2017,2018,2019,2020,2021,2022,2023,2024,2025,null,null,5,"M1HFRS45MAY",353.51,null,5,"M2HFRS45MAY",329.65,null,3,"GAM1STRS34MAR",439.44,null,5,"HLSTRS45MAY",324.37]
[1,"GAM1HFRS78JAN",195.9,131.79,99.76,115.63,107.42,107.42,99.68,121.02,134.16,191.84,224.07,null,null,11,"M1HFRS45NOV",357.94,null,11,"M2HFRS45NOV",334.36,null,5,"GAM1STRS34MAY",445,null,11,"HLSTRS45NOV",318.75]
[2,"GAM1HFRS78FEB",179.92,128.66999999999999,103.19,120.08,114.75,114.75,103.79,124.55,140.78,204.65,227.56,null,null,10,"M1HFRS45OCT",370.77,null,10,"M2HFRS45OCT",341.93,null,11,"GAM1STRS34NOV",456.7,null,10,"HLSTRS45OCT",381.09]
[3,"GAM1HFRS78MAR",193.05,129.9,107.78,117.12,118.45,118.45,108.63,127.8,154.94999999999999,217.77,246.15,null,null,9,"M1HFRS45SEP",376.84,null,9,"M2HFRS45SEP",347.17,null,10,"GAM1STRS34OCT",475.29,null,9,"HLSTRS45SEP",382.67]
[4,"GAM1HFRS78APR",198.46,124.92,115.17,113.99,119.53,119.53,111.19,122.3,164.72,206.56,250.37,null,null,4,"M1HFRS56APR",310,null,4,"M2HFRS56APR",287.18,null,9,"GAM1STRS34SEP",486.89,null,4,"HLSTRS56APR",306.83]
[5,"GAM1HFRS78MAY",186.81,119.69,116.73,111.65,112.22,112.22,105.61,122.33,160.66999999999999,213.54,254.13,null,null,8,"M1HFRS56AUG",343.72,null,8,"M2HFRS56AUG",320.83,null,4,"GAM1STRS45APR",394.52,null,8,"HLSTRS56AUG",342.69]
[6,"GAM1HFRS78JUN",197.48,114.44,118.08,109.24,108.52,108.52,108.43,119.36,175,208.74,254.14,null,null,12,"M1HFRS56DEC",338.65,null,12,"M2HFRS56DEC",317.18,null,8,"GAM1STRS45AUG",421.26,null,12,"HLSTRS56DEC",338.39]
[7,"GAM1HFRS78JUL",190.17,110.63,117.4,112.63,105.71,105.71,109.65,122.33,185.93,214.56,270.25,null,null,2,"M1HFRS56FEB",274.5,null,2,"M2HFRS56FEB",247.51,null,12,"GAM1STRS45DEC",456.6,null,2,"HLSTRS56FEB",260.61]
[8,"GAM1HFRS78AUG",187.41,112.85,115.05,114.57,109.25,109.25,108.73,131.19999999999999,194.31,191.76,276.83999999999997,null,null,1,"M1HFRS56JAN",277.56,null,1,"M2HFRS56JAN",252.84,null,2,"GAM1STRS45FEB",359.08,null,1,"HLSTRS56JAN",252.56]
[9,"GAM1HFRS78SEP",171.32,95.55,113.39,115.89,105.71,105.71,115.09,133.35,197.31,184.66,296.95999999999998,null,null,7,"M1HFRS56JUL",326.83999999999997,null,7,"M2HFRS56JUL",304.42,null,1,"GAM1STRS45JAN",358.28,null,7,"HLSTRS56JUL",311.06]
[10,"GAM1HFRS78OCT",144.63,80.989999999999995,112.1,112.33,100.03,100.03,109.49,119.56,182.43,187.28,282.72000000000003,null,null,6,"M1HFRS56JUN",326.70999999999998,null,6,"M2HFRS56JUN",307.10000000000002,null,7,"GAM1STRS45JUL",405.39,null,6,"HLSTRS56JUN",307.13]
[11,"GAM1HFRS78NOV",142.09,86.23,114.18,110,102.1,102.1,109.77,123.99,175.92,197.31,284.33,null,null,3,"M1HFRS56MAR",294.88,null,3,"M2HFRS56MAR",264.04000000000002,null,6,"GAM1STRS45JUN",398.43,null,3,"HLSTRS56MAR",269.12]
[12,"GAM1HFRS78DEC",140.172,89.04,115.51,112.43,104.8,104.8,113.95,129.55000000000001,170.96,211.63,291.39999999999998,null,null,5,"M1HFRS56MAY",322.61,null,5,"M2HFRS56MAY",305.08999999999997,null,3,"GAM1STRS45MAR",393.42,null,5,"HLSTRS56MAY",301.26]
[null,null,null,null,null,null,null,null,null,null,null,null,null,null,null,11,"M1HFRS56NOV",328.14,null,11,"M2HFRS56NOV",305.16000000000003,null,5,"GAM1STRS45MAY",406.26,null,11,"HLSTRS56NOV",296.67]
[null,null,null,null,null,null,null,null,null,null,null,null,null,null,null,10,"M1HFRS56OCT",346.34,null,10,"M2HFRS56OCT",317.83,null,11,"GAM1STRS45NOV",432.03,null,10,"HLSTRS56OCT",361.4]
[null,null,null,null,null,null,null,null,null,null,null,null,null,null,null,9,"M1HFRS56SEP",350.01,null,9,"M2HFRS56SEP",324.89999999999998,null,10,"GAM1STRS45OCT",425.07,null,9,"HLSTRS56SEP",374.1]
[null,null,null,null,null,null,null,null,null,null,null,null,null,null,null,4,"M1HFRS67APR",277.75,null,4,"M2HFRS67APR",255.58,null,9,"GAM1STRS45SEP",445.27,null,4,"HLSTRS67APR",261]
[null,null,null,null,null,null,null,null,null,null,null,null,null,null,null,8,"M1HFRS67AUG",319.99,null,8,"M2HFRS67AUG",293.3,null,4,"GAM1STRS56APR",362.83,null,8,"HLSTRS67AUG",332]
[null,null,null,null,null,null,null,null,null,null,null,null,null,null,null,12,"M1HFRS67DEC",326.06,null,12,"M2HFRS67DEC",282.88,null,8,"GAM1STRS56AUG",377.98,null,12,"HLSTRS67DEC",305.5]
[null,null,null,null,null,null,null,null,null,null,null,null,null,null,null,2,"M1HFRS67FEB",244.6,null,2,"M2HFRS67FEB",228.01,null,12,"GAM1STRS56DEC",400.03,null,2,"HLSTRS67FEB",232]
[null,null,null,null,null,null,null,null,null,null,null,null,null,null,null,1,"M1HFRS67JAN",248.32,null,1,"M2HFRS67JAN",231.62,null,2,"GAM1STRS56FEB",317.55,null,1,"HLSTRS67JAN",231]
[null,null,null,null,null,null,null,null,null,null,null,null,null,null,null,7,"M1HFRS67JUL",304.39999999999998,null,7,"M2HFRS67JUL",279.79000000000002,null,1,"GAM1STRS56JAN",314.56,null,7,"HLSTRS67JUL",298]
[null,null,null,null,null,null,null,null,null,null,null,null,null,null,null,6,"M1HFRS67JUN",296.27999999999997,null,6,"M2HFRS67JUN",274.22000000000003,null,7,"GAM1STRS56JUL",366.22,null,6,"HLSTRS67JUN",288]
[null,null,null,null,null,null,null,null,null,null,null,null,null,null,null,3,"M1HFRS67MAR",260.79000000000002,null,3,"M2HFRS67MAR",237.07,null,6,"GAM1STRS56JUN",363.01,null,3,"HLSTRS67MAR",237.21]
[null,null,null,null,null,null,null,null,null,null,null,null,null,null,null,5,"M1HFRS67MAY",288.56,null,5,"M2HFRS67MAY",269.26,null,3,"GAM1STRS56MAR",352.57,null,5,"HLSTRS67MAY",278]
[null,null,null,null,null,null,null,null,null,null,null,null,null,null,null,11,"M1HFRS67NOV",311.3,null,11,"M2HFRS67NOV",278.38,null,5,"GAM1STRS56MAY",368.22,null,11,"HLSTRS67NOV",270]
[null,null,null,null,null,null,null,null,null,null,null,null,null,null,null,10,"M1HFRS67OCT",320.45999999999998,null,10,"M2HFRS67OCT",294.52999999999997,null,11,"GAM1STRS56NOV",395.03,null,10,"HLSTRS67OCT",342.5]
[null,null,null,null,null,null,null,null,null,null,null,null,null,null,null,9,"M1HFRS67SEP",326.08999999999997,null,9,"M2HFRS67SEP",303.12,null,10,"GAM1STRS56OCT",388.39,null,9,"HLSTRS67SEP",333.06]
[null,null,null,null,null,null,null,null,null,null,null,null,null,null,null,4,"M1HFRS78APR",249.91,null,4,"M2HFRS78APR",220.69,null,9,"GAM1STRS56SEP",395.31,null,4,"HLSTRS78APR",234.25]
[null,null,null,null,null,null,null,null,null,null,null,null,null,null,null,4,"M1HFRS78APRLOAD",262.13,null,8,"M2HFRS78AUG",272.13,null,4,"GAM1STRS67APR",325.18,null,8,"HLSTRS78AUG",319]
[null,null,null,null,null,null,null,null,null,null,null,null,null,null,null,8,"M1HFRS78AUG",297.16000000000003,null,12,"M2HFRS78DEC",268.82,null,8,"GAM1STRS67AUG",349.39,null,12,"HLSTRS78DEC",279]
[null,null,null,null,null,null,null,null,null,null,null,null,null,null,null,8,"M1HFRS78AUGLOAD",329.18,null,2,"M2HFRS78FEB",209.51,null,12,"GAM1STRS67DEC",358.43,null,2,"HLSTRS78FEB",213.5]
[null,null,null,null,null,null,null,null,null,null,null,null,null,null,null,12,"M1HFRS78DEC",281.02999999999997,null,1,"M2HFRS78JAN",210.22,null,2,"GAM1STRS67FEB",284.57,null,1,"HLSTRS78JAN",217.8]
[null,null,null,null,null,null,null,null,null,null,null,null,null,null,null,12,"M1HFRS78DECLOAD",309.77,null,7,"M2HFRS78JUL",253.55,null,1,"GAM1STRS67JAN",278.18,null,7,"HLSTRS78JUL",265]
[null,null,null,null,null,null,null,null,null,null,null,null,null,null,null,2,"M1HFRS78FEB",227.22,null,6,"M2HFRS78JUN",242.38,null,7,"GAM1STRS67JUL",335.23,null,6,"HLSTRS78JUN",284]
[null,null,null,null,null,null,null,null,null,null,null,null,null,null,null,2,"M1HFRS78FEBLOAD",242.43,null,3,"M2HFRS78MAR",202.07,null,6,"GAM1STRS67JUN",333.77,null,3,"HLSTRS78MAR",226.5]
[null,null,null,null,null,null,null,null,null,null,null,null,null,null,null,1,"M1HFRS78JAN",232.81,null,5,"M2HFRS78MAY",236.27,null,3,"GAM1STRS67MAR",306.57,null,5,"HLSTRS78MAY",242]
[null,null,null,null,null,null,null,null,null,null,null,null,null,null,null,1,"M1HFRS78JANLOAD",248.78,null,11,"M2HFRS78NOV",258.08,null,5,"GAM1STRS67MAY",336.28,null,11,"HLSTRS78NOV",263]
[null,null,null,null,null,null,null,null,null,null,null,null,null,null,null,7,"M1HFRS78JUL",270.27999999999997,null,10,"M2HFRS78OCT",264.75,null,11,"GAM1STRS67NOV",344.61,null,10,"HLSTRS78OCT",303]
[null,null,null,null,null,null,null,null,null,null,null,null,null,null,null,7,"M1HFRS78JULLOAD",308.68,null,9,"M2HFRS78SEP",278.77,null,10,"GAM1STRS67OCT",351.07,null,9,"HLSTRS78SEP",327]
[null,null,null,null,null,null,null,null,null,null,null,null,null,null,null,6,"M1HFRS78JUN",264.2,null,null,null,null,null,9,"GAM1STRS67SEP",361.12]
[null,null,null,null,null,null,null,null,null,null,null,null,null,null,null,6,"M1HFRS78JUNLOAD",287.91000000000003,null,null,null,null,null,4,"GAM1STRS78APR",287.29000000000002]
[null,null,null,null,null,null,null,null,null,null,null,null,null,null,null,3,"M1HFRS78MAR",237.84,null,4,"M2STRS34APR",389.98,null,8,"GAM1STRS78AUG",325.07]
[null,null,null,null,null,null,null,null,null,null,null,null,null,null,null,3,"M1HFRS78MARLOAD",251.74,null,8,"M2STRS34AUG",399.78,null,12,"GAM1STRS78DEC",317.18]
[null,null,null,null,null,null,null,null,null,null,null,null,null,null,null,5,"M1HFRS78MAY",260.18,null,12,"M2STRS34DEC",414.23,null,2,"GAM1STRS78FEB",252.25]
[null,null,null,null,null,null,null,null,null,null,null,null,null,null,null,5,"M1HFRS78MAYLOAD",279.23,null,2,"M2STRS34FEB",343.01,null,1,"GAM1STRS78JAN",255.49]
[null,null,null,null,null,null,null,null,null,null,null,null,null,null,null,11,"M1HFRS78NOV",287.63,null,1,"M2STRS34JAN",318.43,null,7,"GAM1STRS78JUL",297.27999999999997]
[null,null,null,null,null,null,null,null,null,null,null,null,null,null,null,11,"M1HFRS78NOVLOAD",302.56,null,7,"M2STRS34JUL",384.78,null,6,"GAM1STRS78JUN",287.75]
[null,null,null,null,null,null,null,null,null,null,null,null,null,null,null,10,"M1HFRS78OCT",314.88,null,6,"M2STRS34JUN",387.95,null,3,"GAM1STRS78MAR",278.2]
[null,null,null,null,null,null,null,null,null,null,null,null,null,null,null,10,"M1HFRS78OCTLOAD",337.02,null,3,"M2STRS34MAR",363.59,null,5,"GAM1STRS78MAY",288.63]
[null,null,null,null,null,null,null,null,null,null,null,null,null,null,null,9,"M1HFRS78SEP",307.66000000000003,null,5,"M2STRS34MAY",369.16,null,11,"GAM1STRS78NOV",312.3]
[null,null,null,null,null,null,null,null,null,null,null,null,null,null,null,9,"M1HFRS78SEPLOAD",341.18,null,11,"M2STRS34NOV",393.5,null,10,"GAM1STRS78OCT",320.04000000000002]
[null,null,null,null,null,null,null,null,null,null,null,null,null,null,null,null,null,null,null,10,"M2STRS34OCT",399.7,null,9,"GAM1STRS78SEP",327.24]
[null,null,null,null,null,null,null,null,null,null,null,null,null,null,null,null,null,null,null,9,"M2STRS34SEP",423.72]
[null,null,null,null,null,null,null,null,null,null,null,null,null,null,null,4,"M1STRS34APR",425.5,null,4,"M2STRS45APR",358.65,null,4,"GAM1HFRS34APR",382.26]
[null,null,null,null,null,null,null,null,null,null,null,null,null,null,null,8,"M1STRS34AUG",452.3,null,8,"M2STRS45AUG",385.11,null,8,"GAM1HFRS34AUG",418.45]
[null,null,null,null,null,null,null,null,null,null,null,null,null,null,null,12,"M1STRS34DEC",451.16,null,12,"M2STRS45DEC",385.95,null,12,"GAM1HFRS34DEC",428.32]
[null,null,null,null,null,null,null,null,null,null,null,null,null,null,null,2,"M1STRS34FEB",384.78,null,2,"M2STRS45FEB",303.13,null,2,"GAM1HFRS34FEB",332.54]
[null,null,null,null,null,null,null,null,null,null,null,null,null,null,null,1,"M1STRS34JAN",386.43,null,1,"M2STRS45JAN",300.52,null,1,"GAM1HFRS34JAN",342.42]
[null,null,null,null,null,null,null,null,null,null,null,null,null,null,null,7,"M1STRS34JUL",424.81,null,7,"M2STRS45JUL",368.2,null,7,"GAM1HFRS34JUL",398.78]
[null,null,null,null,null,null,null,null,null,null,null,null,null,null,null,6,"M1STRS34JUN",427.99,null,6,"M2STRS45JUN",362.34,null,6,"GAM1HFRS34JUN",386.64]
[null,null,null,null,null,null,null,null,null,null,null,null,null,null,null,3,"M1STRS34MAR",424,null,3,"M2STRS45MAR",324.99,null,3,"GAM1HFRS34MAR",377.08]
[null,null,null,null,null,null,null,null,null,null,null,null,null,null,null,5,"M1STRS34MAY",444.93,null,5,"M2STRS45MAY",368.05,null,5,"GAM1HFRS34MAY",397.94]
[null,null,null,null,null,null,null,null,null,null,null,null,null,null,null,11,"M1STRS34NOV",440.83,null,11,"M2STRS45NOV",379.12,null,11,"GAM1HFRS34NOV",395.06]
[null,null,null,null,null,null,null,null,null,null,null,null,null,null,null,10,"M1STRS34OCT",452.03,null,10,"M2STRS45OCT",377.25,null,10,"GAM1HFRS34OCT",413.58]
[null,null,null,null,null,null,null,null,null,null,null,null,null,null,null,9,"M1STRS34SEP",473.27,null,9,"M2STRS45SEP",375.72,null,9,"GAM1HFRS34SEP",437.78]
[null,null,null,null,null,null,null,null,null,null,null,null,null,null,null,4,"M1STRS45APR",394.2,null,4,"M2STRS56APR",328.35,null,4,"GAM1HFRS45APR",346.47]
[null,null,null,null,null,null,null,null,null,null,null,null,null,null,null,8,"M1STRS45AUG",416.78,null,8,"M2STRS56AUG",359.92,null,8,"GAM1HFRS45AUG",378.19]
[null,null,null,null,null,null,null,null,null,null,null,null,null,null,null,12,"M1STRS45DEC",420.29,null,12,"M2STRS56DEC",338,null,12,"GAM1HFRS45DEC",392]
[null,null,null,null,null,null,null,null,null,null,null,null,null,null,null,2,"M1STRS45FEB",347.66,null,2,"M2STRS56FEB",274.99,null,2,"GAM1HFRS45FEB",306.72000000000003]
[null,null,null,null,null,null,null,null,null,null,null,null,null,null,null,1,"M1STRS45JAN",345.45,null,1,"M2STRS56JAN",275.77999999999997,null,1,"GAM1HFRS45JAN",303.64999999999998]
[null,null,null,null,null,null,null,null,null,null,null,null,null,null,null,7,"M1STRS45JUL",389.92,null,7,"M2STRS56JUL",337.19,null,7,"GAM1HFRS45JUL",361.2]
[null,null,null,null,null,null,null,null,null,null,null,null,null,null,null,6,"M1STRS45JUN",396.41,null,6,"M2STRS56JUN",337.32,null,6,"GAM1HFRS45JUN",355.47]
[null,null,null,null,null,null,null,null,null,null,null,null,null,null,null,3,"M1STRS45MAR",380.49,null,3,"M2STRS56MAR",293.99,null,3,"GAM1HFRS45MAR",338.57]
[null,null,null,null,null,null,null,null,null,null,null,null,null,null,null,5,"M1STRS45MAY",405.28,null,5,"M2STRS56MAY",330.53,null,5,"GAM1HFRS45MAY",359.8]
[null,null,null,null,null,null,null,null,null,null,null,null,null,null,null,11,"M1STRS45NOV",414.02,null,11,"M2STRS56NOV",341.97,null,11,"GAM1HFRS45NOV",367.81]
[null,null,null,null,null,null,null,null,null,null,null,null,null,null,null,10,"M1STRS45OCT",410.21,null,10,"M2STRS56OCT",350.9,null,10,"GAM1HFRS45OCT",379.33]
[null,null,null,null,null,null,null,null,null,null,null,null,null,null,null,9,"M1STRS45SEP",420.6,null,9,"M2STRS56SEP",356.17,null,9,"GAM1HFRS45SEP",393.81]
[null,null,null,null,null,null,null,null,null,null,null,null,null,null,null,4,"M1STRS56APR",357.09,null,4,"M2STRS67APR",291.08999999999997,null,4,"GAM1HFRS56APR",315.32]
[null,null,null,null,null,null,null,null,null,null,null,null,null,null,null,8,"M1STRS56AUG",380.83,null,8,"M2STRS67AUG",337.64,null,8,"GAM1HFRS56AUG",341.57]
[null,null,null,null,null,null,null,null,null,null,null,null,null,null,null,12,"M1STRS56DEC",383.14,null,12,"M2STRS67DEC",324.76,null,12,"GAM1HFRS56DEC",349.48]
[null,null,null,null,null,null,null,null,null,null,null,null,null,null,null,2,"M1STRS56FEB",308.61,null,2,"M2STRS67FEB",346.48,null,2,"GAM1HFRS56FEB",276.39999999999998]
[null,null,null,null,null,null,null,null,null,null,null,null,null,null,null,1,"M1STRS56JAN",309.86,null,1,"M2STRS67JAN",251.94,null,1,"GAM1HFRS56JAN",271.85000000000002]
[null,null,null,null,null,null,null,null,null,null,null,null,null,null,null,7,"M1STRS56JUL",365.03,null,7,"M2STRS67JUL",314.07,null,7,"GAM1HFRS56JUL",331.4]
[null,null,null,null,null,null,null,null,null,null,null,null,null,null,null,6,"M1STRS56JUN",363.4,null,6,"M2STRS67JUN",310.11,null,6,"GAM1HFRS56JUN",326.31]
[null,null,null,null,null,null,null,null,null,null,null,null,null,null,null,3,"M1STRS56MAR",336.2,null,3,"M2STRS67MAR",270.95999999999998,null,3,"GAM1HFRS56MAR",304.52]
[null,null,null,null,null,null,null,null,null,null,null,null,null,null,null,5,"M1STRS56MAY",363.32,null,5,"M2STRS67MAY",306.37,null,5,"GAM1HFRS56MAY",329]
[null,null,null,null,null,null,null,null,null,null,null,null,null,null,null,11,"M1STRS56NOV",373.97,null,11,"M2STRS67NOV",315.95,null,11,"GAM1HFRS56NOV",335.17]
[null,null,null,null,null,null,null,null,null,null,null,null,null,null,null,10,"M1STRS56OCT",380.32,null,10,"M2STRS67OCT",332.83,null,10,"GAM1HFRS56OCT",344.7]
[null,null,null,null,null,null,null,null,null,null,null,null,null,null,null,9,"M1STRS56SEP",383.41,null,9,"M2STRS67SEP",334.74,null,9,"GAM1HFRS56SEP",354.85]
[null,null,null,null,null,null,null,null,null,null,null,null,null,null,null,4,"M1STRS67APR",317.45999999999998,null,4,"M2STRS78APR",262.73,null,4,"GAM1HFRS67APR",277.37]
[null,null,null,null,null,null,null,null,null,null,null,null,null,null,null,8,"M1STRS67AUG",353.26,null,8,"M2STRS78AUG",307.04000000000002,null,8,"GAM1HFRS67AUG",316.82]
[null,null,null,null,null,null,null,null,null,null,null,null,null,null,null,12,"M1STRS67DEC",347.1,null,12,"M2STRS78DEC",299.16000000000003,null,12,"GAM1HFRS67DEC",323.07]
[null,null,null,null,null,null,null,null,null,null,null,null,null,null,null,2,"M1STRS67FEB",276.44,null,2,"M2STRS78FEB",221.25,null,2,"GAM1HFRS67FEB",251.01]
[null,null,null,null,null,null,null,null,null,null,null,null,null,null,null,1,"M1STRS67JAN",280.39,null,1,"M2STRS78JAN",236.16,null,1,"GAM1HFRS67JAN",246.31]
[null,null,null,null,null,null,null,null,null,null,null,null,null,null,null,7,"M1STRS67JUL",338.9,null,7,"M2STRS78JUL",295.64999999999998,null,7,"GAM1HFRS67JUL",301.81]
[null,null,null,null,null,null,null,null,null,null,null,null,null,null,null,6,"M1STRS67JUN",330.9,null,6,"M2STRS78JUN",278.04000000000002,null,6,"GAM1HFRS67JUN",299.57]
[null,null,null,null,null,null,null,null,null,null,null,null,null,null,null,3,"M1STRS67MAR",299.14,null,3,"M2STRS78MAR",251.28,null,3,"GAM1HFRS67MAR",264.88]
[null,null,null,null,null,null,null,null,null,null,null,null,null,null,null,5,"M1STRS67MAY",329.31,null,5,"M2STRS78MAY",271.89,null,5,"GAM1HFRS67MAY",295.67]
[null,null,null,null,null,null,null,null,null,null,null,null,null,null,null,11,"M1STRS67NOV",344.07,null,11,"M2STRS78NOV",294.63,null,11,"GAM1HFRS67NOV",309.89]
[null,null,null,null,null,null,null,null,null,null,null,null,null,null,null,10,"M1STRS67OCT",354.84,null,10,"M2STRS78OCT",314.48,null,10,"GAM1HFRS67OCT",321.27]
[null,null,null,null,null,null,null,null,null,null,null,null,null,null,null,9,"M1STRS67SEP",358.35,null,9,"M2STRS78SEP",321.17,null,9,"GAM1HFRS67SEP",330.21]
[null,null,null,null,null,null,null,null,null,null,null,null,null,null,null,4,"M1STRS78APR",290.36,null,null,null,null,null,4,"GAM1HFRS78APR",250.37]
[null,null,null,null,null,null,null,null,null,null,null,null,null,null,null,4,"M1STRS78APRLOAD",278.38,null,null,null,null,null,8,"GAM1HFRS78AUG",276.83999999999997]
[null,null,null,null,null,null,null,null,null,null,null,null,null,null,null,8,"M1STRS78AUG",331.57,null,null,null,null,null,12,"GAM1HFRS78DEC",291.39999999999998]
[null,null,null,null,null,null,null,null,null,null,null,null,null,null,null,8,"M1STRS78AUGLOAD",362.95,null,null,null,null,null,2,"GAM1HFRS78FEB",227.56]
[null,null,null,null,null,null,null,null,null,null,null,null,null,null,null,12,"M1STRS78DEC",322.98,null,null,null,null,null,1,"GAM1HFRS78JAN",224.07]
[null,null,null,null,null,null,null,null,null,null,null,null,null,null,null,12,"M1STRS78DECLOAD",349.5,null,null,null,null,null,7,"GAM1HFRS78JUL",270.25]
[null,null,null,null,null,null,null,null,null,null,null,null,null,null,null,2,"M1STRS78FEB",249.76,null,null,null,null,null,6,"GAM1HFRS78JUN",254.14]
[null,null,null,null,null,null,null,null,null,null,null,null,null,null,null,2,"M1STRS78FEBLOAD",255.83,null,null,null,null,null,3,"GAM1HFRS78MAR",246.15]
[null,null,null,null,null,null,null,null,null,null,null,null,null,null,null,1,"M1STRS78JAN",258.27999999999997,null,null,null,null,null,5,"GAM1HFRS78MAY",254.13]
[null,null,null,null,null,null,null,null,null,null,null,null,null,null,null,1,"M1STRS78JANLOAD",271.64,null,null,null,null,null,11,"GAM1HFRS78NOV",284.33,null,null,null,null,null,null,null,null,null,null,null,null,null,null,null,null,null,null,1,"M1STRS78JANLOAD",116.84285714285714,143.05937499999999,140.88888888888889,163.66666666666666,232.35,158.5,131.25,146.85,146.87,146.82,136.22999999999999]
[null,null,null,null,null,null,null,null,null,null,null,null,null,null,null,7,"M1STRS78JUL",315.89,null,null,null,null,null,10,"GAM1HFRS78OCT",282.72000000000003,null,null,null,null,null,null,null,null,null,null,null,null,null,null,null,null,null,null,2,"M1STRS78FEBLOAD",118.2,151.38,136.5,163.57,182.5,143.88,122.85,146.72,143.19,137.41999999999999,138.82]
[null,null,null,null,null,null,null,null,null,null,null,null,null,null,null,7,"M1STRS78JULLOAD",338.22,null,null,null,null,null,9,"GAM1HFRS78SEP",296.95999999999998,null,null,null,null,null,null,null,null,null,null,null,null,null,null,null,null,null,null,3,"M1STRS78MARLOAD",121.28,144.08000000000001,139.58000000000001,170.53,201.62,145,116.27,140.44999999999999,142.29,133.51,137.52000000000001]
[null,null,null,null,null,null,null,null,null,null,null,null,null,null,null,6,"M1STRS78JUN",304.29000000000002,null,null,null,null,null,null,null,null,null,null,null,null,null,null,null,null,null,null,null,null,null,null,null,null,null,null,4,"M1STRS78APRLOAD",128.05000000000001,142.03,131.31,172.76,207.5,153.58000000000001,133.75,137.24,145.80000000000001,110.57]
[null,null,null,null,null,null,null,null,null,null,null,null,null,null,null,6,"M1STRS78JUNLOAD",326.02999999999997,null,null,null,null,null,null,null,null,null,null,null,null,null,null,null,null,null,null,null,null,null,null,null,null,null,null,5,"M1STRS78MAYLOAD",123.6,144.30000000000001,129.68,183.25,210.26,134.25,144.55000000000001,139.99,142.27000000000001,127.5]
[null,null,null,null,null,null,null,null,null,null,null,null,null,null,null,3,"M1STRS78MAR",268.54000000000002,null,null,null,null,null,null,null,null,null,null,null,null,null,null,null,null,null,null,null,null,null,null,null,null,null,null,6,"M1STRS78JUNLOAD",120.85,144.63999999999999,134.78,199.15,207,135.6,146.13,146,137.04,null,150.19999999999999]
[null,null,null,null,null,null,null,null,null,null,null,null,null,null,null,3,"M1STRS78MARLOAD",284.10000000000002,null,null,null,null,null,null,null,null,null,null,null,null,null,null,null,null,null,null,null,null,null,null,null,null,null,null,7,"M1STRS78JULLOAD",134.36000000000001,130.41,142.13999999999999,227,222.17,139.62,149.68,150.66999999999999,142.54,134.52000000000001,157.05000000000001]
[null,null,null,null,null,null,null,null,null,null,null,null,null,null,null,5,"M1STRS78MAY",297.36,null,null,null,null,null,null,null,null,null,null,null,null,null,null,null,null,null,null,null,null,null,null,null,null,null,null,8,"M1STRS78AUGLOAD",127.88,134.26,149.66999999999999,213.98,217.87,144.31,147.25,149.25,134.19999999999999,143.55000000000001,159.19999999999999]
[null,null,null,null,null,null,null,null,null,null,null,null,null,null,null,5,"M1STRS78MAYLOAD",310.75,null,null,null,null,null,null,null,null,null,null,null,null,null,null,null,null,null,null,null,null,null,null,null,null,null,null,9,"M1STRS78SEPLOAD",122.21,139.33000000000001,154.85,226.32,196.28,128.25,143.08000000000001,154.18,136.15,138.11000000000001,159.38999999999999]
[null,null,null,null,null,null,null,null,null,null,null,null,null,null,null,11,"M1STRS78NOV",319.04000000000002,null,null,null,null,null,null,null,null,null,null,null,null,null,null,null,null,null,null,null,null,null,null,null,null,null,null,10,"M1STRS78OCTLOAD",131.66,140.68,158.75,228.35,174.75,120.23,153.91999999999999,155.97,142.81,139.01,156.28]
[null,null,null,null,null,null,null,null,null,null,null,null,null,null,null,11,"M1STRS78NOVLOAD",326.55,null,null,null,null,null,null,null,null,null,null,null,null,null,null,null,null,null,null,null,null,null,null,null,null,null,null,11,"M1STRS78NOVLOAD",136.63,140.13999999999999,162.66999999999999,231.69,169.43,119.42,156.35,149.91999999999999,145.96,137.49,159.21]
[null,null,null,null,null,null,null,null,null,null,null,null,null,null,null,10,"M1STRS78OCT",335.96,null,null,null,null,null,null,null,null,null,null,null,null,null,null,null,null,null,null,null,null,null,null,null,null,null,null,12,"M1STRS78DECLOAD",135.41999999999999,141.31,156.88,238.63,148.08000000000001,128,154.62,145.21,140.96,140.36000000000001,165.54]
[null,null,null,null,null,null,null,null,null,null,null,null,null,null,null,10,"M1STRS78OCTLOAD",376.63]
[null,null,null,null,null,null,null,null,null,null,null,null,null,null,null,9,"M1STRS78SEP",338.89]
[null,null,null,null,null,null,null,null,null,null,null,null,null,null,null,9,"M1STRS78SEPLOAD",354.5]
[null,null,null,null,null,null,null,null,null,null,null,null,null,null,null,4,"M1STRS89APRLOAD",275.89999999999998]
[null,null,null,null,null,null,null,null,null,null,null,null,null,null,null,8,"M1STRS89AUGLOAD",342.22]
[null,null,null,null,null,null,null,null,null,null,null,null,null,null,null,12,"M1STRS89DECLOAD",328.47]
[null,null,null,null,null,null,null,null,null,null,null,null,null,null,null,2,"M1STRS89FEBLOAD",258.74]
[null,null,null,null,null,null,null,null,null,null,null,null,null,null,null,1,"M1STRS89JANLOAD",260.38]
[null,null,null,null,null,null,null,null,null,null,null,null,null,null,null,7,"M1STRS89JULLOAD",319.14999999999998]
[null,null,null,null,null,null,null,null,null,null,null,null,null,null,null,6,"M1STRS89JUNLOAD",299.33999999999997,null,1,"M1HFRS78JANLOAD"]
[null,null,null,null,null,null,null,null,null,null,null,null,null,null,null,3,"M1STRS89MARLOAD",270.85000000000002,null,2,"M1HFRS78FEBLOAD"]
[null,null,null,null,null,null,null,null,null,null,null,null,null,null,null,5,"M1STRS89MAYLOAD",284.45999999999998,null,3,"M1HFRS78MARLOAD",null,null,null,null,null,null,null,null,null,null,null,null,null,null,null,null,null,null,null,null,null,null,null,1,"M1STRS89JANLOAD",113.78125,140.32499999999999,139.51249999999999,158.23088235294117,208.87423076923076,147.47,131.07,145.81,144.34,146.07,136.08000000000001]
[null,null,null,null,null,null,null,null,null,null,null,null,null,null,null,11,"M1STRS89NOVLOAD",327.86,null,4,"M1HFRS78APRLOAD",null,null,null,null,null,null,null,null,null,null,null,null,null,null,null,null,null,null,null,null,null,null,null,2,"M1STRS89FEBLOAD",117.41,144.16999999999999,130.6,152.13,185.42,140.21,123.67,146.97,143.85,138.37,139.32]
[null,null,null,null,null,null,null,null,null,null,null,null,null,null,null,10,"M1STRS89OCTLOAD",347.33,null,5,"M1HFRS78MAYLOAD",null,null,null,null,null,null,null,null,null,null,null,null,null,null,null,null,null,null,null,null,null,null,null,3,"M1STRS89MARLOAD",118.5,140.41999999999999,126.74,159.88999999999999,194.33,141.75,128.03,142.19,143.13999999999999,128.72999999999999,138.11000000000001]
[null,null,null,null,null,null,null,null,null,null,null,null,null,null,null,9,"M1STRS89SEPLOAD",350.85,null,6,"M1HFRS78JUNLOAD",null,null,null,null,null,null,null,null,null,null,null,null,null,null,null,null,null,null,null,null,null,null,null,4,"M1STRS89APRLOAD",123.78,133.94999999999999,125.69,167.31,201.84,139.01,135.41,138.13,145.75,116.8,145.41]
[null,null,null,null,null,null,null,null,null,null,null,null,null,null,null,null,null,null,null,7,"M1HFRS78JULLOAD",null,null,null,null,null,null,null,null,null,null,null,null,null,null,null,null,null,null,null,null,null,null,null,5,"M1STRS89MAYLOAD",119.86,138.43,124.66,175.46,211.66,137.25,143.51,137.35,137.41999999999999,127.5,134.9]
[null,null,null,null,null,null,null,null,null,null,null,null,null,null,null,null,null,null,null,8,"M1HFRS78AUGLOAD",null,null,null,null,null,null,null,null,null,null,null,null,null,null,null,null,null,null,null,null,null,null,null,6,"M1STRS89JUNLOAD",122.68,140.65,127.47,194.69,211.09,138.86000000000001,150.91999999999999,147.54,137.43,132.5,152]
[null,null,null,null,null,null,null,null,null,null,null,null,null,null,null,null,null,null,null,9,"M1HFRS78SEPLOAD",null,null,null,null,null,null,null,null,null,null,null,null,null,null,null,null,null,null,null,null,null,null,null,7,"M1STRS89JULLOAD",129.11000000000001,129.15,136.83000000000001,210.67,208.89,135.15,148.58000000000001,151.81,142.28,136.58000000000001,158.25]
[null,null,null,null,null,null,null,null,null,null,null,null,null,null,null,null,null,null,null,10,"M1HFRS78OCTLOAD",null,null,null,null,null,null,null,null,null,null,null,null,null,null,null,null,null,null,null,null,null,null,null,8,"M1STRS89AUGLOAD",122.87,128.09,143.24,211.16,202.03,139.05000000000001,146.85,149.34,136.36000000000001,143.30000000000001,158.58000000000001]
[null,null,null,null,null,null,null,null,null,null,null,null,null,null,null,null,null,null,null,11,"M1HFRS78NOVLOAD",null,null,null,null,null,null,null,null,null,null,null,null,null,null,null,null,null,null,null,null,null,null,null,9,"M1STRS89SEPLOAD",120.84,132.63999999999999,142.9,211.34,184.85,128.19999999999999,146.33000000000001,152.85,137.41,137.71,158.16]
[null,null,null,null,null,null,null,null,null,null,null,null,null,null,null,null,null,null,null,12,"M1HFRS78DECLOAD",null,null,null,null,null,null,null,null,null,null,null,null,null,null,null,null,null,null,null,null,null,null,null,10,"M1STRS89OCTLOAD",126.58,135.03,151.88,225.19,172.91,116.1,153.52000000000001,156.80000000000001,142.72999999999999,140.47999999999999,157.72999999999999]
[null,null,null,null,null,null,null,null,null,null,null,null,null,null,null,1,"M1STRS78JANLOAD",null,null,null,null,null,null,null,null,null,null,null,null,null,null,null,null,null,null,null,null,null,null,null,null,null,null,null,11,"M1STRS89NOVLOAD",132.71,137.63,156.25,224.72,170.98,124.23,158.24,150.22999999999999,146.38,137.52000000000001,158.02000000000001]
[null,null,null,null,null,null,null,null,null,null,null,null,null,null,null,2,"M1STRS78FEBLOAD",null,null,null,null,null,null,null,null,null,null,null,null,null,"M1STRS78JANLOAD",143.05937499999999,140.88888888888889,163.66666666666666,232.35,158.5,131.25,146.85,146.87,146.82,136.22999999999999,181.1,null,null,12,"M1STRS89DECLOAD",133.47,137.27000000000001,153.76,218.4,144.96,124.53,145.99,146.12,140.88,140.15,165.41]
[null,null,null,null,null,null,null,null,null,null,null,null,null,null,null,3,"M1STRS78MARLOAD",null,null,null,null,null,null,null,null,null,null,null,null,null,"M1STRS78FEBLOAD",151.38,136.5,163.57,182.5,143.88,122.85,146.72,143.19,137.41999999999999,138.82,185.71]
[null,null,null,null,null,null,null,null,null,null,null,null,null,null,null,4,"M1STRS78APRLOAD",null,null,null,null,null,null,null,null,null,null,null,null,null,"M1STRS78MARLOAD",144.08000000000001,139.58000000000001,170.53,201.62,145,116.27,140.44999999999999,142.29,133.51,137.52000000000001,189.94]
[null,null,null,null,null,null,null,null,null,null,null,null,null,null,null,5,"M1STRS78MAYLOAD",null,null,null,null,null,null,null,null,null,null,null,null,null,"M1STRS78APRLOAD",142.03,131.31,172.76,207.5,153.58000000000001,133.75,137.24,145.80000000000001,110.57,138.16999999999999,197.89]
[null,null,null,null,null,null,null,null,null,null,null,null,null,null,null,6,"M1STRS78JUNLOAD",null,null,null,null,null,null,null,null,null,null,null,null,null,"M1STRS78MAYLOAD",144.30000000000001,129.68,183.25,210.26,134.25,144.55000000000001,139.99,142.27000000000001,127.5,144.19,202.52]
[null,null,null,null,null,null,null,null,null,null,null,null,null,null,null,7,"M1STRS78JULLOAD",null,null,null,null,null,null,null,null,null,null,null,null,null,"M1STRS78JUNLOAD",144.63999999999999,134.78,199.15,207,135.6,146.13,146,137.04,127.34,150.19999999999999,234.81]
[null,null,null,null,null,null,null,null,null,null,null,null,null,null,null,8,"M1STRS78AUGLOAD",null,null,null,null,null,null,null,null,null,null,null,null,null,"M1STRS78JULLOAD",130.41,142.13999999999999,227,222.17,139.62,149.68,150.66999999999999,142.54,134.52000000000001,157.05000000000001,246.8]
[null,null,null,null,null,null,null,null,null,null,null,null,null,null,null,9,"M1STRS78SEPLOAD",null,null,null,null,null,null,null,null,null,null,null,null,null,"M1STRS78AUGLOAD",134.26,149.66999999999999,213.98,217.87,144.31,147.25,149.25,134.19999999999999,143.55000000000001,159.19999999999999,248.42]
[null,null,null,null,null,null,null,null,null,null,null,null,null,null,null,10,"M1STRS78OCTLOAD",null,null,null,null,null,null,null,null,null,null,null,null,null,"M1STRS78SEPLOAD",139.33000000000001,154.85,226.32,196.28,128.25,143.08000000000001,154.18,136.15,138.11000000000001,159.38999999999999,252.92]
[null,null,null,null,null,null,null,null,null,null,null,null,null,null,null,11,"M1STRS78NOVLOAD",null,null,null,null,null,null,null,null,null,null,null,null,null,"M1STRS78OCTLOAD",140.68,158.75,228.35,174.75,120.23,153.91999999999999,155.97,142.81,139.01,156.28,244.5]
[null,null,null,null,null,null,null,null,null,null,null,null,null,null,null,12,"M1STRS78DECLOAD",null,null,null,null,null,null,null,null,null,null,null,null,null,"M1STRS78NOVLOAD",140.13999999999999,162.66999999999999,231.69,169.43,119.42,156.35,149.91999999999999,145.96,137.49,159.21,239.92]
[null,null,null,null,null,null,null,null,null,null,null,null,null,null,null,null,null,null,null,null,null,null,null,null,null,null,null,null,null,null,"M1STRS78DECLOAD",141.31,156.88,238.63,148.08000000000001,128,154.62,145.21,140.96,140.36000000000001,165.54,215.9]
[null,null,null,null,null,null,null,null,null,null,null,null,null,null,null,1,"M1STRS89JANLOAD"]
[null,null,null,null,null,null,null,null,null,null,null,null,null,null,null,2,"M1STRS89FEBLOAD",null,null,null,null,null,null,null,null,null,null,null,null,null,null,{"$f":"AF177-AF178","v":0.54000000000002046},-3.9199999999999875,-3.3400000000000034,5.3199999999999932,0.81000000000000227,-2.4300000000000068,6.0500000000000114,-3.1500000000000057,{"$f":"AN177-AN178","v":1.5199999999999818},{"$f":"AO177-AO178","v":-2.9300000000000068},{"$f":"AVERAGE(AF181:AO181)","v":-0.15300000000000011}]
[null,null,null,null,null,null,null,null,null,null,null,null,null,null,null,3,"M1STRS89MARLOAD"]
[null,null,null,null,null,null,null,null,null,null,null,null,null,null,null,4,"M1STRS89APRLOAD"]
[null,null,null,null,null,null,null,null,null,null,null,null,null,null,null,5,"M1STRS89MAYLOAD"]
[null,null,null,null,null,null,null,null,null,null,null,null,null,null,null,6,"M1STRS89JUNLOAD"]
[null,null,null,null,null,null,null,null,null,null,null,null,null,null,null,7,"M1STRS89JULLOAD",null,null,null,null,null,null,null,null,null,null,null,null,null,"M1STRS89JANLOAD",140.32499999999999,139.51249999999999,158.23088235294117,208.87423076923076,147.47,131.07,145.81,144.34,146.07,136.08000000000001,181.74]
[null,null,null,null,null,null,null,null,null,null,null,null,null,null,null,8,"M1STRS89AUGLOAD",null,null,null,null,null,null,null,null,null,null,null,null,null,"M1STRS89FEBLOAD",144.16999999999999,130.6,152.13,185.42,140.21,123.67,146.97,143.85,138.37,139.32,185.84]
[null,null,null,null,null,null,null,null,null,null,null,null,null,null,null,9,"M1STRS89SEPLOAD",null,null,null,null,null,null,null,null,null,null,null,null,null,"M1STRS89MARLOAD",140.41999999999999,126.74,159.88999999999999,194.33,141.75,128.03,142.19,143.13999999999999,128.72999999999999,138.11000000000001,189.61]
[null,null,null,null,null,null,null,null,null,null,null,null,null,null,null,10,"M1STRS89OCTLOAD",null,null,null,null,null,null,null,null,null,null,null,null,null,"M1STRS89APRLOAD",133.94999999999999,125.69,167.31,201.84,139.01,135.41,138.13,145.75,116.8,145.41,200.75]
[null,null,null,null,null,null,null,null,null,null,null,null,null,null,null,11,"M1STRS89NOVLOAD",null,null,null,null,null,null,null,null,null,null,null,null,null,"M1STRS89MAYLOAD",138.43,124.66,175.46,211.66,137.25,143.51,137.35,137.41999999999999,127.5,134.9,216.51]
[null,null,null,null,null,null,null,null,null,null,null,null,null,null,null,12,"M1STRS89DECLOAD",null,null,null,null,null,null,null,null,null,null,null,null,null,"M1STRS89JUNLOAD",140.65,127.47,194.69,211.09,138.86000000000001,150.91999999999999,147.54,137.43,132.5,152,239.01]
[null,null,null,null,null,null,null,null,null,null,null,null,null,null,null,null,null,null,null,null,null,null,null,null,null,null,null,null,null,null,"M1STRS89JULLOAD",129.15,136.83000000000001,210.67,208.89,135.15,148.58000000000001,151.81,142.28,136.58000000000001,158.25,245.94]
[null,null,null,null,null,null,null,null,null,null,null,null,null,null,null,null,null,null,null,null,null,null,null,null,null,null,null,null,null,null,"M1STRS89AUGLOAD",128.09,143.24,211.16,202.03,139.05000000000001,146.85,149.34,136.36000000000001,143.30000000000001,158.58000000000001,248.02]
[null,null,null,null,null,null,null,null,null,null,null,null,null,null,null,null,null,null,null,null,null,null,null,null,null,null,null,null,null,null,"M1STRS89SEPLOAD",132.63999999999999,142.9,211.34,184.85,128.19999999999999,146.33000000000001,152.85,137.41,137.71,158.16,253.61]
[null,null,null,null,null,null,null,null,null,null,null,null,null,null,null,null,null,null,null,null,null,null,null,null,null,null,null,null,null,null,"M1STRS89OCTLOAD",135.03,151.88,225.19,172.91,116.1,153.52000000000001,156.80000000000001,142.72999999999999,140.47999999999999,157.72999999999999,246.81]
[null,null,null,null,null,null,null,null,null,null,null,null,null,null,null,1,"M1STRS78JAN",null,null,null,null,null,null,null,null,null,null,null,null,null,"M1STRS89NOVLOAD",137.63,156.25,224.72,170.98,124.23,158.24,150.22999999999999,146.38,137.52000000000001,158.02000000000001,232.8]
[null,null,null,null,null,null,null,null,null,null,null,null,null,null,null,2,"M1STRS78FEB",null,null,null,null,null,null,null,null,null,null,null,null,null,"M1STRS89DECLOAD",137.27000000000001,153.76,218.4,144.96,124.53,145.99,146.12,140.88,140.15,165.41,214.35]
[null,null,null,null,null,null,null,null,null,null,null,null,null,null,null,3,"M1STRS78MAR"]
[null,null,null,null,null,null,null,null,null,null,null,null,null,null,null,4,"M1STRS78APR",null,null,null,null,null,null,null,null,null,null,null,null,null,"M1HFRS78FEBLOAD",114.57727272727271,140.89166666666668,126.54375,143.65,173.33333333333334,130,128.41,146.83000000000001,143.37,136.32,139.27000000000001,null,null,2,"M1HFRS78FEBLOAD",114.57727272727271,140.89166666666668,126.54375,143.65,173.33333333333334,130,128.41,146.83000000000001,143.37,136.32,139.27000000000001]
[null,null,null,null,null,null,null,null,null,null,null,null,null,null,null,5,"M1STRS78MAY",null,null,null,null,null,null,null,null,null,null,null,null,null,"M1HFRS78MAYLOAD",117.85208333333333,135.51249999999999,120.63214285714285,169.0625,205.75,124.13,140.37,139.99,138.30000000000001,130.27000000000001,147.74,null,null,5,"M1HFRS78MAYLOAD",117.85208333333333,135.51249999999999,120.63214285714285,169.0625,205.75,124.13,140.37,139.99,138.30000000000001,130.27000000000001]
[null,null,null,null,null,null,null,null,null,null,null,null,null,null,null,6,"M1STRS78JUN",null,null,null,null,null,null,null,null,null,null,null,null,null,"M1HFRS78AUGLOAD",120.173,126.94583333333333,137.69999999999999,203,200.3125,135.6,144.63999999999999,150.13,139.94,143.36000000000001,157.65,null,null,8,"M1HFRS78AUGLOAD",120.173,126.94583333333333,137.69999999999999,203,200.3125,135.6,144.63999999999999,150.13,139.94,143.36000000000001,157.65]
[null,null,null,null,null,null,null,null,null,null,null,null,null,null,null,7,"M1STRS78JUL",null,null,null,null,null,null,null,null,null,null,null,null,null,"M1HFRS78NOVLOAD",126.27812499999999,131.1875,142.68,220,161.96666666666667,105.04,158.6,149.86000000000001,147.27000000000001,137.28,161.86000000000001,null,null,11,"M1HFRS78NOVLOAD",126.27812499999999,131.1875,142.68,220,161.96666666666667,105.04,158.6,149.86000000000001,147.27000000000001,137.28,161.86000000000001]
[null,null,null,null,null,null,null,null,null,null,null,null,null,null,null,8,"M1STRS78AUG",null,null,null,null,null,null,null,null,null,null,null,null,null,null,{"$f":"#REF!-AF202","v":{"$error":"#REF!"}},{"$f":"#REF!-AG202","v":{"$error":"#REF!"}},{"$f":"#REF!-AH202","v":{"$error":"#REF!"}},{"$f":"#REF!-AI202","v":{"$error":"#REF!"}},{"$f":"#REF!-AJ202","v":{"$error":"#REF!"}},{"$f":"#REF!-AK202","v":{"$error":"#REF!"}},{"$f":"#REF!-AL202","v":{"$error":"#REF!"}},{"$f":"#REF!-AM202","v":{"$error":"#REF!"}},{"$f":"#REF!-AN202","v":{"$error":"#REF!"}},{"$f":"#REF!-AO202","v":{"$error":"#REF!"}},{"$f":"AVERAGE(AF203:AO203)","v":{"$error":"#REF!"}}]
[null,null,null,null,null,null,null,null,null,null,null,null,null,null,null,9,"M1STRS78SEP"]
[null,null,null,null,null,null,null,null,null,null,null,null,null,null,null,10,"M1STRS78OCT",null,null,null,null,null,null,null,null,null,null,null,null,null,"HLSTRS34JAN",94.16,106.83,107.58,119.845,190.44,125,77.64,69.010000000000005,73.33,95,183.83]
[null,null,null,null,null,null,null,null,null,null,null,null,null,null,null,11,"M1STRS78NOV",null,null,null,null,null,null,null,null,null,null,null,null,null,"HLSTRS34APR",119.51,127.03,113.88,144.89500000000001,223.4,141.9,91.96,97.35,84.24,95.16,200.71]
[null,null,null,null,null,null,null,null,null,null,null,null,null,null,null,12,"M1STRS78DEC",null,null,null,null,null,null,null,null,null,null,null,null,null,"HLSTRS34JUL",92.41,106.86,95.92,166.5,206,100.12,96.49,81.45,79.290000000000006,98.06,197.86]
[null,null,null,null,null,null,null,null,null,null,null,null,null,null,null,null,null,null,null,null,null,null,null,null,null,null,null,null,null,null,"HLSTRS34OCT",96.74,116.25,120.98,191.72499999999999,169.24,80.81,80.319999999999993,77.430000000000007,83.77,111.29,147]
[null,null,null,null,null,null,null,null,null,null,null,null,null,null,null,null,null,null,null,null,null,null,null,null,null,null,null,null,null,null,"HLSTRS34NOV",98.1,111.61,108.76,192.38,163.96,76.69,97.88,61.88,78.8,111.76,141.19999999999999]
[null,null,null,null,null,null,null,null,null,null,null,null,null,null,null,null,null,null,null,null,null,null,null,null,null,null,null,null,null,null,"HLSTRS34DEC",102.99,109.84,107.7,208.95499999999998,144.62,70.75,94.99,60,86.11,111.06,183.17]
[null,null,null,null,null,null,null,null,null,null,null,null,null,null,null,null,null,null,null,null,null,null,null,null,null,null,null,null,null,null,"HLSTRS45JAN",86.55,111.43,103.66,112.785,165.88,114.07,71.040000000000006,86.74,78.89,102.98,188.37]
[null,null,null,null,null,null,null,null,null,null,null,null,null,null,null,null,null,null,null,null,null,null,null,null,null,null,null,null,null,null,"HLSTRS45FEB",92.57,111.91,112.34,125.5,162.99,123.5,76.290000000000006,91.74,67.58,111.8,163.76]
[null,null,null,null,null,null,null,null,null,null,null,null,null,null,null,null,null,null,null,null,null,null,null,null,null,null,null,null,null,null,"HLSTRS45MAR",102.93,124.6,100.37,129.13999999999999,195.62,132.91,70.55,98.82,84.84,108.76,188.97]
[null,null,null,null,null,null,null,null,null,null,null,null,null,null,null,null,null,null,null,null,null,null,null,null,null,null,null,null,null,null,"HLSTRS45APR",101.4,117.19,113.38,135.66000000000003,203.15,138.81,99.28,89.71,78.89,93.23,192.23]
[null,null,null,null,null,null,null,null,null,null,null,null,null,null,null,null,null,null,null,null,null,null,null,null,null,null,null,null,null,null,"HLSTRS45MAY",94.59,117.79,109.15,148.83999999999997,204.34,123.98,90.09,75.680000000000007,91.37,96.02,195.79]
[null,null,null,null,null,null,null,null,null,null,null,null,null,null,null,null,null,null,null,null,null,null,null,null,null,null,null,null,null,null,"HLSTRS45JUN",88.9,117.64,105.16,168.86500000000001,207.48,113.04,92.74,79.61,91.09,94.65,200]
[null,null,null,null,null,null,null,null,null,null,null,null,null,null,null,null,null,null,null,null,null,null,null,null,null,null,null,null,null,null,"HLSTRS45JUL",94.54,101.06,97.3,168.82999999999998,182.12,107.35,95.23,88.61,84.55,92.79,181.97]
[null,null,null,null,null,null,null,null,null,null,null,null,null,null,null,null,null,null,null,null,null,null,null,null,null,null,null,null,null,null,"HLSTRS45AUG",91.83,99.12,106.54,171.67000000000002,185.21,100.8,95.78,86.46,88.3,94.29,199.48]
[null,null,null,null,null,null,null,null,null,null,null,null,null,null,null,null,null,null,null,null,null,null,null,null,null,null,null,null,null,null,"HLSTRS45SEP",89.72,100.46,110.27,180.935,156.72,122.05,75.58,91,84.07,100.66,186.16]
[null,null,null,null,null,null,null,null,null,null,null,null,null,null,null,null,null,null,null,null,null,null,null,null,null,null,null,null,null,null,"HLSTRS45OCT",92.2,101.04,107.5,182.58500000000001,158.34,74.56,86.05,71.64,77.5,121.93,150.84]
[null,null,null,null,null,null,null,null,null,null,null,null,null,null,null,null,null,null,null,null,null,null,null,null,null,null,null,null,null,null,"HLSTRS45NOV",95.06,101.4,111.56,189.66,148.34,89.68,96.22,68.599999999999994,80.31,106.95,143.52000000000001]
[null,null,null,null,null,null,null,null,null,null,null,null,null,null,null,null,null,null,null,null,null,null,null,null,null,null,null,null,null,null,"HLSTRS45DEC",97.99,105.14,107.66,188.185,96.49,71.37,90.08,68.22,81.55,112.03,178.05]
[null,null,null,null,null,null,null,null,null,null,null,null,null,null,null,null,null,null,null,null,null,null,null,null,null,null,null,null,null,null,"HLSTRS56APR",94.1,110.54,97.37,135.505,190.1,125.36,90.24,84.8,91.69,103.38,196.7]
[null,null,null,null,null,null,null,null,null,null,null,null,null,null,null,null,null,null,null,null,null,null,null,null,null,null,null,null,null,null,"HLSTRS56AUG",90.01,92.57,98.16,168.495,176.57,103.13,89.61,77.400000000000006,87.58,109.07,157.22999999999999]
[null,null,null,null,null,null,null,null,null,null,null,null,null,null,null,null,null,null,null,null,null,null,null,null,null,null,null,null,null,null,"HLSTRS56DEC",91.36,96.04,109.16,181.30500000000001,110.83,63.16,89.22,59,80.64,108.93,188.77]
[null,null,null,null,null,null,null,null,null,null,null,null,null,null,null,null,null,null,null,null,null,null,null,null,null,null,null,null,null,null,"HLSTRS56FEB",88.24,106.37,92.15,126.185,171.12,117.78,70.040000000000006,78.23,57,93.7,195.8]
[null,null,null,null,null,null,null,null,null,null,null,null,null,null,null,null,null,null,null,null,null,null,null,null,null,null,null,null,null,null,"HLSTRS56JAN",85.7,100.77,91.65,102.86499999999999,175.58,117.76,68.94,85.1,66,81.93,186.19]
[null,null,null,null,null,null,null,null,null,null,null,null,null,null,null,null,null,null,null,null,null,null,null,null,null,null,null,null,null,null,"HLSTRS56JUL",98.21,92.17,94.06,155.83500000000001,163.77000000000001,92.3,93.44,73,78.58,109.43,202.85]
[null,null,null,null,null,null,null,null,null,null,null,null,null,null,null,null,null,null,null,null,null,null,null,null,null,null,null,null,null,null,"HLSTRS56JUN",89.47,108.79,88.62,156.14999999999998,190.57,100.55,85.89,85.38,88.69,89.81,183.13]
[null,null,null,null,null,null,null,null,null,null,null,null,null,null,null,null,null,null,null,null,null,null,null,null,null,null,null,null,null,null,"HLSTRS56MAR",92.34,117.62,100.35,121.82,188.77,122.49,61,85.9,77.88,87.88,196.63]
[null,null,null,null,null,null,null,null,null,null,null,null,null,null,null,null,null,null,null,null,null,null,null,null,null,null,null,null,null,null,"HLSTRS56MAY",86.64,120.44,88.08,140.52500000000001,189.84,125,85.33,81.36,87.39,93.06,168.57]
[null,null,null,null,null,null,null,null,null,null,null,null,null,null,null,null,null,null,null,null,null,null,null,null,null,null,null,null,null,null,"HLSTRS56NOV",81.58,95.11,109.75,180.23000000000002,130.63999999999999,72.349999999999994,81.36,68.11,79.739999999999995,113.03,149.94999999999999]
[null,null,null,null,null,null,null,null,null,null,null,null,null,null,null,null,null,null,null,null,null,null,null,null,null,null,null,null,null,null,"HLSTRS56OCT",93.97,96.41,101.67,174.37,148.69,57.52,80.16,72.23,74.97,106.2,141.03]
[null,null,null,null,null,null,null,null,null,null,null,null,null,null,null,null,null,null,null,null,null,null,null,null,null,null,null,null,null,null,"HLSTRS56SEP",90.09,100.48,99.17,186.495,157.25,112.37,73.260000000000005,72.319999999999993,82.37,104.38,182.89]
[null,null,null,null,null,null,null,null,null,null,null,null,null,null,null,null,null,null,null,null,null,null,null,null,null,null,null,null,null,null,"HLSTRS67APR",95.05,111.05,92.77,116.19,174.05,114,76.84,78.930000000000007,90.44,99.29,184.95]
[null,null,null,null,null,null,null,null,null,null,null,null,null,null,null,null,null,null,null,null,null,null,null,null,null,null,null,null,null,null,"HLSTRS67AUG",82.79,77.16,96.91,157.86500000000001,164.79,91.8,80.94,76.930000000000007,89.5,106.08,160.24]
[null,null,null,null,null,null,null,null,null,null,null,null,null,null,null,null,null,null,null,null,null,null,null,null,null,null,null,null,null,null,"HLSTRS67DEC",89.34,84.46,102.54,176.19,105.6,64.319999999999993,89.96,62.56,86.51,104.8,169.2]
[null,null,null,null,null,null,null,null,null,null,null,null,null,null,null,null,null,null,null,null,null,null,null,null,null,null,null,null,null,null,"HLSTRS67FEB",82.85,100.01,85.18,116.82,163.27000000000001,113.98,71.03,88.38,68.849999999999994,96.5,178.16]
[null,null,null,null,null,null,null,null,null,null,null,null,null,null,null,null,null,null,null,null,null,null,null,null,null,null,null,null,null,null,"HLSTRS67JAN",79.209999999999994,93.87,87.94,107.5,162.99,106.54,63.15,76.41,85.24,91.4,180.65]
[null,null,null,null,null,null,null,null,null,null,null,null,null,null,null,null,null,null,null,null,null,null,null,null,null,null,null,null,null,null,"HLSTRS67JUL",89.12,91.14,93.63,159.38999999999999,175.06,100.83,85.92,68.989999999999995,84.38,102.64,193.51]
[null,null,null,null,null,null,null,null,null,null,null,null,null,null,null,null,null,null,null,null,null,null,null,null,null,null,null,null,null,null,"HLSTRS67JUN",84.07,104.04,83.16,141.9,185.31,99.33,83.47,77.12,86.23,74.760000000000005,173.68]
[null,null,null,null,null,null,null,null,null,null,null,null,null,null,null,null,null,null,null,null,null,null,null,null,null,null,null,null,null,null,"HLSTRS67MAR",88.94,101.85,90.47,134.255,166.57,113.28,57.5,87,70.37,90.84,177.33]
[null,null,null,null,null,null,null,null,null,null,null,null,null,null,null,null,null,null,null,null,null,null,null,null,null,null,null,null,null,null,"HLSTRS67MAY",90.73,98.23,77.95,129.26999999999998,182.68,103.48,86.89,68.42,84.37,96.39,175.28]
[null,null,null,null,null,null,null,null,null,null,null,null,null,null,null,null,null,null,null,null,null,null,null,null,null,null,null,null,null,null,"HLSTRS67NOV",83.62,90.07,106.18,161.065,132.88999999999999,68.599999999999994,74.569999999999993,68.3,75.58,101.94,142.43]
[null,null,null,null,null,null,null,null,null,null,null,null,null,null,null,null,null,null,null,null,null,null,null,null,null,null,null,null,null,null,"HLSTRS67OCT",86.41,87.12,103.08,167.745,120.69,65.16,75.099999999999994,67.22,77.45,103.45,109.57]
[null,null,null,null,null,null,null,null,null,null,null,null,null,null,null,null,null,null,null,null,null,null,null,null,null,null,null,null,null,null,"HLSTRS67SEP",82.97,93.91,95.86,167.07,145.71,104.19,66.83,74,82.72,102.49,164.5]
[null,null,null,null,null,null,null,null,null,null,null,null,null,null,null,null,null,null,null,null,null,null,null,null,null,null,null,null,null,null,"HLSTRS78APR",88,92.09,77.239999999999995,138.72,157.82,105.25,71.349999999999994,75.86,81.900000000000006,91.5,159.34]
[null,null,null,null,null,null,null,null,null,null,null,null,null,null,null,null,null,null,null,null,null,null,null,null,null,null,null,null,null,null,"HLSTRS78AUG",76.39,80.95,88.61,164.04500000000002,167.44,87.03,76.959999999999994,73.5,88.06,98.75,154.18]
[null,null,null,null,null,null,null,null,null,null,null,null,null,null,null,null,null,null,null,null,null,null,null,null,null,null,null,null,null,null,"HLSTRS78DEC",89.12,82.7,100.97,149,104,57.82,79.489999999999995,53,83.76,95.95,171.34]
[null,null,null,null,null,null,null,null,null,null,null,null,null,null,null,null,null,null,null,null,null,null,null,null,null,null,null,null,null,null,"HLSTRS78FEB",76.099999999999994,105.69,84,115.16,145.76,105.69,70.45,73,65.38,95.14,174.36]
[null,null,null,null,null,null,null,null,null,null,null,null,null,null,null,null,null,null,null,null,null,null,null,null,null,null,null,null,null,null,"HLSTRS78JAN",79.59,89.52,87.47,108.97,146.5,115.56,66.52,79.11,72.8,90.75,177.37]
[null,null,null,null,null,null,null,null,null,null,null,null,null,null,null,null,null,null,null,null,null,null,null,null,null,null,null,null,null,null,"HLSTRS78JUL",86.12,87.64,84.92,141.845,170.4,98,78.3,88.42,79.650000000000006,97.25,166.5]
[null,null,null,null,null,null,null,null,null,null,null,null,null,null,null,null,null,null,null,null,null,null,null,null,null,null,null,null,null,null,"HLSTRS78JUN",78.69,92.25,92.99,153.06,166.26,98.58,85.06,73.98,78.56,72.930000000000007,149]
[null,null,null,null,null,null,null,null,null,null,null,null,null,null,null,null,null,null,null,null,null,null,null,null,null,null,null,null,null,null,"HLSTRS78MAR",85.75,94.32,84.84,124.595,154.25,101.37,68.53,83.69,75,90.27,157.5]
[null,null,null,null,null,null,null,null,null,null,null,null,null,null,null,null,null,null,null,null,null,null,null,null,null,null,null,null,null,null,"HLSTRS78MAY",86,92.59,79.87,151.33500000000001,164.14,98.6,70,73.72,74.489999999999995,80.5,122.99]
[null,null,null,null,null,null,null,null,null,null,null,null,null,null,null,null,null,null,null,null,null,null,null,null,null,null,null,null,null,null,"HLSTRS78NOV",81.52,78.599999999999994,98.76,167.35500000000002,124.99,65.83,79.56,60.71,78.650000000000006,94.39,88.48]
[null,null,null,null,null,null,null,null,null,null,null,null,null,null,null,null,null,null,null,null,null,null,null,null,null,null,null,null,null,null,"HLSTRS78OCT",77.78,76.42,89.24,159.86000000000001,130.27000000000001,66.59,83.04,56.71,56.67,98.41,131.88]
[null,null,null,null,null,null,null,null,null,null,null,null,null,null,null,null,null,null,null,null,null,null,null,null,null,null,null,null,null,null,"HLSTRS78SEP",82.85,84.2,81.540000000000006,153.89499999999998,137.18,95.91,71.16,69,84.01,102.42,164]
[null,null,null,null,null,null,null,null,null,null,null,null,null,null,null,null,null,null,null,null,null,null,null,null,null,null,null,null,null,null,null,null,null,null,null,null,null,null,null,null,null,156.5]
[null,null,null,null,null,null,null,null,null,null,null,null,null,null,null,null,null,null,null,null,null,null,null,null,null,null,null,null,null,null,null,null,null,null,null,null,null,null,null,null,null,118.74]
[null,null,null,null,null,null,null,null,null,null,null,null,null,null,null,null,null,null,null,null,null,null,null,null,null,null,null,null,null,null,null,null,null,null,null,null,null,null,null,null,null,156.5]
[null,null,null,null,null,null,null,null,null,null,null,null,null,null,null,null,null,null,null,null,null,null,null,null,null,null,null,null,null,null,null,null,null,null,null,null,null,null,null,null,null,168.75]
[null,null,null,null,null,null,null,null,null,null,null,null,null,null,null,null,null,null,null,null,null,null,null,null,null,null,null,null,null,null,null,null,null,null,null,null,null,null,null,null,null,170]
[null,null,null,null,null,null,null,null,null,null,null,null,null,null,null,null,null,null,null,null,null,null,null,null,null,null,null,null,null,null,null,null,null,null,null,null,null,null,null,null,null,175]